BDBM277736 3-[(5-chloro-1-propyl-1H-indazol-3-yl)amino]pyridine-4-carboxylic acid::US10040779, Example 33::US10336727, Example 33::US9617242, Example 33
SMILES: CCCn1nc(Nc2cnccc2C(O)=O)c2cc(Cl)ccc12
InChI Key: InChIKey=ASGLMUMSWBQYBM-UHFFFAOYSA-N
Data: 9 IC50
Activity Spreadsheet -- Enzyme Inhibition Constant Data from BindingDB
Found 9 hits for monomerid = 277736
Trg + Lig
Ki
nM
ΔG°
kcal/mole
IC50
nM
Kd
nM
EC50/IC50
nM
koff
s-1
kon
M-1s-1
pHTemp
°C
Lysine-specific demethylase 5A
(Homo sapiens (Human))
BDBM277736
(3-[(5-chloro-1-propyl-1H-indazol-3-yl)amino]pyridi...)
Show SMILES CCCn1nc(Nc2cnccc2C(O)=O)c2cc(Cl)ccc12
Show InChI InChI=1S/C16H15ClN4O2/c1-2-7-21-14-4-3-10(17)8-12(14)15(20-21)19-13-9-18-6-5-11(13)16(22)23/h3-6,8-9H,2,7H2,1H3,(H,19,20)(H,22,23)
Reactome pathway
US Patent
n/an/a<0.100n/an/an/an/an/an/a
Celgene Quanticel Research, Inc.
US Patent
Assay Description
The enzymatic assay of Jarid1A activity is based upon Time Resolved-Fluorescence Resonance Energy Transfer (TR-FRET) detection. The ability of test c...
US Patent US10040779 (2018)
BindingDB Entry DOI: 10.7270/Q26H4KF1
Lysine-specific demethylase 5B
(Homo sapiens (Human))
BDBM277736
(3-[(5-chloro-1-propyl-1H-indazol-3-yl)amino]pyridi...)
Show SMILES CCCn1nc(Nc2cnccc2C(O)=O)c2cc(Cl)ccc12
Show InChI InChI=1S/C16H15ClN4O2/c1-2-7-21-14-4-3-10(17)8-12(14)15(20-21)19-13-9-18-6-5-11(13)16(22)23/h3-6,8-9H,2,7H2,1H3,(H,19,20)(H,22,23)
US Patent
n/an/a<0.100n/an/an/an/an/an/a
Celgene Quanticel Research, Inc.
US Patent
Assay Description
The ability of test compounds to inhibit the activity of Jarid1B was determined in 384-well plate format under the following reaction conditions: 0.8...
US Patent US10040779 (2018)
BindingDB Entry DOI: 10.7270/Q26H4KF1
Lysine-specific demethylase 4C
(Homo sapiens (Human))
BDBM277736
(3-[(5-chloro-1-propyl-1H-indazol-3-yl)amino]pyridi...)
Show SMILES CCCn1nc(Nc2cnccc2C(O)=O)c2cc(Cl)ccc12
Show InChI InChI=1S/C16H15ClN4O2/c1-2-7-21-14-4-3-10(17)8-12(14)15(20-21)19-13-9-18-6-5-11(13)16(22)23/h3-6,8-9H,2,7H2,1H3,(H,19,20)(H,22,23)
US Patent
n/an/a 0.550n/an/an/an/an/an/a
Celgene Quanticel Research, Inc.
US Patent
Assay Description
The ability of test compounds to inhibit the activity of JMJD2C was determined in 384-well plate format under the following reaction conditions: 0.3 ...
US Patent US10040779 (2018)
BindingDB Entry DOI: 10.7270/Q26H4KF1
Lysine-specific demethylase 5A
(Homo sapiens (Human))
BDBM277736
(3-[(5-chloro-1-propyl-1H-indazol-3-yl)amino]pyridi...)
Show SMILES CCCn1nc(Nc2cnccc2C(O)=O)c2cc(Cl)ccc12
Show InChI InChI=1S/C16H15ClN4O2/c1-2-7-21-14-4-3-10(17)8-12(14)15(20-21)19-13-9-18-6-5-11(13)16(22)23/h3-6,8-9H,2,7H2,1H3,(H,19,20)(H,22,23)
Reactome pathway
US Patent
n/an/a<100n/an/an/an/an/an/a
CELGENE QUANTICEL RESEARCH, INC.
US Patent
Assay Description
The enzymatic assay of Jarid1A activity is based upon Time Resolved-Fluorescence Resonance Energy Transfer (TR-FRET) detection. The ability of test c...
US Patent US9617242 (2017)
BindingDB Entry DOI: 10.7270/Q2XK8HM5
Lysine-specific demethylase 4C
(Homo sapiens (Human))
BDBM277736
(3-[(5-chloro-1-propyl-1H-indazol-3-yl)amino]pyridi...)
Show SMILES CCCn1nc(Nc2cnccc2C(O)=O)c2cc(Cl)ccc12
Show InChI InChI=1S/C16H15ClN4O2/c1-2-7-21-14-4-3-10(17)8-12(14)15(20-21)19-13-9-18-6-5-11(13)16(22)23/h3-6,8-9H,2,7H2,1H3,(H,19,20)(H,22,23)
US Patent
n/an/a 550n/an/an/an/an/an/a
Celgene Quanticel Research Inc
US Patent
Assay Description
The ability of test compounds to inhibit the activity of JMJD2C was determined in 384-well plate format under the following reaction conditions: 0.3 ...
US Patent US10336727 (2019)
BindingDB Entry DOI: 10.7270/Q2571FBT
Lysine-specific demethylase 4C
(Homo sapiens (Human))
BDBM277736
(3-[(5-chloro-1-propyl-1H-indazol-3-yl)amino]pyridi...)
Show SMILES CCCn1nc(Nc2cnccc2C(O)=O)c2cc(Cl)ccc12
Show InChI InChI=1S/C16H15ClN4O2/c1-2-7-21-14-4-3-10(17)8-12(14)15(20-21)19-13-9-18-6-5-11(13)16(22)23/h3-6,8-9H,2,7H2,1H3,(H,19,20)(H,22,23)
US Patent
n/an/a 550n/an/an/an/an/an/a
CELGENE QUANTICEL RESEARCH, INC.
US Patent
Assay Description
The ability of test compounds to inhibit the activity of JMJD2C was determined in 384-well plate format under the following reaction conditions: 0.3 ...
US Patent US9617242 (2017)
BindingDB Entry DOI: 10.7270/Q2XK8HM5
Lysine-specific demethylase 5A
(Homo sapiens (Human))
BDBM277736
(3-[(5-chloro-1-propyl-1H-indazol-3-yl)amino]pyridi...)
Show SMILES CCCn1nc(Nc2cnccc2C(O)=O)c2cc(Cl)ccc12
Show InChI InChI=1S/C16H15ClN4O2/c1-2-7-21-14-4-3-10(17)8-12(14)15(20-21)19-13-9-18-6-5-11(13)16(22)23/h3-6,8-9H,2,7H2,1H3,(H,19,20)(H,22,23)
Reactome pathway
US Patent
n/an/a<100n/an/an/an/an/an/a
Celgene Quanticel Research Inc
US Patent
Assay Description
The enzymatic assay of Jarid1A activity is based upon Time Resolved-Fluorescence Resonance Energy Transfer (TR-FRET) detection. The ability of test c...
US Patent US10336727 (2019)
BindingDB Entry DOI: 10.7270/Q2571FBT
Lysine-specific demethylase 5B
(Homo sapiens (Human))
BDBM277736
(3-[(5-chloro-1-propyl-1H-indazol-3-yl)amino]pyridi...)
Show SMILES CCCn1nc(Nc2cnccc2C(O)=O)c2cc(Cl)ccc12
Show InChI InChI=1S/C16H15ClN4O2/c1-2-7-21-14-4-3-10(17)8-12(14)15(20-21)19-13-9-18-6-5-11(13)16(22)23/h3-6,8-9H,2,7H2,1H3,(H,19,20)(H,22,23)
US Patent
n/an/a<100n/an/an/an/an/an/a
Celgene Quanticel Research Inc
US Patent
Assay Description
The ability of test compounds to inhibit the activity of Jarid1B was determined in 384-well plate format under the following reaction conditions: 0.8...
US Patent US10336727 (2019)
BindingDB Entry DOI: 10.7270/Q2571FBT
Lysine-specific demethylase 5B
(Homo sapiens (Human))
BDBM277736
(3-[(5-chloro-1-propyl-1H-indazol-3-yl)amino]pyridi...)
Show SMILES CCCn1nc(Nc2cnccc2C(O)=O)c2cc(Cl)ccc12
Show InChI InChI=1S/C16H15ClN4O2/c1-2-7-21-14-4-3-10(17)8-12(14)15(20-21)19-13-9-18-6-5-11(13)16(22)23/h3-6,8-9H,2,7H2,1H3,(H,19,20)(H,22,23)
US Patent
n/an/a<100n/an/an/an/an/an/a
CELGENE QUANTICEL RESEARCH, INC.
US Patent
Assay Description
The ability of test compounds to inhibit the activity of Jarid1B was determined in 384-well plate format under the following reaction conditions: 0.8...
US Patent US9617242 (2017)
BindingDB Entry DOI: 10.7270/Q2XK8HM5