BDBM277740 3-{[1-(cyclopropylmethyl)-5-methyl-1H-indazol-3-yl]amino}pyridine-4-carboxylic acid::US10040779, Example 37::US10336727, Example 37::US9617242, Example 37
SMILES: Cc1ccc2n(CC3CC3)nc(Nc3cnccc3C(O)=O)c2c1
InChI Key: InChIKey=YWUCPKBZEIIOAT-UHFFFAOYSA-N
Data: 9 IC50
Activity Spreadsheet -- Enzyme Inhibition Constant Data from BindingDB
Found 9 hits for monomerid = 277740
Trg + Lig
Ki
nM
ΔG°
kcal/mole
IC50
nM
Kd
nM
EC50/IC50
nM
koff
s-1
kon
M-1s-1
pHTemp
°C
Lysine-specific demethylase 5A
(Homo sapiens (Human))
BDBM277740
(3-{[1-(cyclopropylmethyl)-5-methyl-1H-indazol-3-yl...)
Show SMILES Cc1ccc2n(CC3CC3)nc(Nc3cnccc3C(O)=O)c2c1
Show InChI InChI=1S/C18H18N4O2/c1-11-2-5-16-14(8-11)17(21-22(16)10-12-3-4-12)20-15-9-19-7-6-13(15)18(23)24/h2,5-9,12H,3-4,10H2,1H3,(H,20,21)(H,23,24)
Reactome pathway
US Patent
n/an/a<0.100n/an/an/an/an/an/a
Celgene Quanticel Research, Inc.
US Patent
Assay Description
The enzymatic assay of Jarid1A activity is based upon Time Resolved-Fluorescence Resonance Energy Transfer (TR-FRET) detection. The ability of test c...
US Patent US10040779 (2018)
BindingDB Entry DOI: 10.7270/Q26H4KF1
Lysine-specific demethylase 5B
(Homo sapiens (Human))
BDBM277740
(3-{[1-(cyclopropylmethyl)-5-methyl-1H-indazol-3-yl...)
Show SMILES Cc1ccc2n(CC3CC3)nc(Nc3cnccc3C(O)=O)c2c1
Show InChI InChI=1S/C18H18N4O2/c1-11-2-5-16-14(8-11)17(21-22(16)10-12-3-4-12)20-15-9-19-7-6-13(15)18(23)24/h2,5-9,12H,3-4,10H2,1H3,(H,20,21)(H,23,24)
US Patent
n/an/a<0.100n/an/an/an/an/an/a
Celgene Quanticel Research, Inc.
US Patent
Assay Description
The ability of test compounds to inhibit the activity of Jarid1B was determined in 384-well plate format under the following reaction conditions: 0.8...
US Patent US10040779 (2018)
BindingDB Entry DOI: 10.7270/Q26H4KF1
Lysine-specific demethylase 4C
(Homo sapiens (Human))
BDBM277740
(3-{[1-(cyclopropylmethyl)-5-methyl-1H-indazol-3-yl...)
Show SMILES Cc1ccc2n(CC3CC3)nc(Nc3cnccc3C(O)=O)c2c1
Show InChI InChI=1S/C18H18N4O2/c1-11-2-5-16-14(8-11)17(21-22(16)10-12-3-4-12)20-15-9-19-7-6-13(15)18(23)24/h2,5-9,12H,3-4,10H2,1H3,(H,20,21)(H,23,24)
US Patent
n/an/a 0.550n/an/an/an/an/an/a
Celgene Quanticel Research, Inc.
US Patent
Assay Description
The ability of test compounds to inhibit the activity of JMJD2C was determined in 384-well plate format under the following reaction conditions: 0.3 ...
US Patent US10040779 (2018)
BindingDB Entry DOI: 10.7270/Q26H4KF1
Lysine-specific demethylase 5A
(Homo sapiens (Human))
BDBM277740
(3-{[1-(cyclopropylmethyl)-5-methyl-1H-indazol-3-yl...)
Show SMILES Cc1ccc2n(CC3CC3)nc(Nc3cnccc3C(O)=O)c2c1
Show InChI InChI=1S/C18H18N4O2/c1-11-2-5-16-14(8-11)17(21-22(16)10-12-3-4-12)20-15-9-19-7-6-13(15)18(23)24/h2,5-9,12H,3-4,10H2,1H3,(H,20,21)(H,23,24)
Reactome pathway
US Patent
n/an/a<100n/an/an/an/an/an/a
CELGENE QUANTICEL RESEARCH, INC.
US Patent
Assay Description
The enzymatic assay of Jarid1A activity is based upon Time Resolved-Fluorescence Resonance Energy Transfer (TR-FRET) detection. The ability of test c...
US Patent US9617242 (2017)
BindingDB Entry DOI: 10.7270/Q2XK8HM5
Lysine-specific demethylase 4C
(Homo sapiens (Human))
BDBM277740
(3-{[1-(cyclopropylmethyl)-5-methyl-1H-indazol-3-yl...)
Show SMILES Cc1ccc2n(CC3CC3)nc(Nc3cnccc3C(O)=O)c2c1
Show InChI InChI=1S/C18H18N4O2/c1-11-2-5-16-14(8-11)17(21-22(16)10-12-3-4-12)20-15-9-19-7-6-13(15)18(23)24/h2,5-9,12H,3-4,10H2,1H3,(H,20,21)(H,23,24)
US Patent
n/an/a 550n/an/an/an/an/an/a
Celgene Quanticel Research Inc
US Patent
Assay Description
The ability of test compounds to inhibit the activity of JMJD2C was determined in 384-well plate format under the following reaction conditions: 0.3 ...
US Patent US10336727 (2019)
BindingDB Entry DOI: 10.7270/Q2571FBT
Lysine-specific demethylase 4C
(Homo sapiens (Human))
BDBM277740
(3-{[1-(cyclopropylmethyl)-5-methyl-1H-indazol-3-yl...)
Show SMILES Cc1ccc2n(CC3CC3)nc(Nc3cnccc3C(O)=O)c2c1
Show InChI InChI=1S/C18H18N4O2/c1-11-2-5-16-14(8-11)17(21-22(16)10-12-3-4-12)20-15-9-19-7-6-13(15)18(23)24/h2,5-9,12H,3-4,10H2,1H3,(H,20,21)(H,23,24)
US Patent
n/an/a 550n/an/an/an/an/an/a
CELGENE QUANTICEL RESEARCH, INC.
US Patent
Assay Description
The ability of test compounds to inhibit the activity of JMJD2C was determined in 384-well plate format under the following reaction conditions: 0.3 ...
US Patent US9617242 (2017)
BindingDB Entry DOI: 10.7270/Q2XK8HM5
Lysine-specific demethylase 5A
(Homo sapiens (Human))
BDBM277740
(3-{[1-(cyclopropylmethyl)-5-methyl-1H-indazol-3-yl...)
Show SMILES Cc1ccc2n(CC3CC3)nc(Nc3cnccc3C(O)=O)c2c1
Show InChI InChI=1S/C18H18N4O2/c1-11-2-5-16-14(8-11)17(21-22(16)10-12-3-4-12)20-15-9-19-7-6-13(15)18(23)24/h2,5-9,12H,3-4,10H2,1H3,(H,20,21)(H,23,24)
Reactome pathway
US Patent
n/an/a<100n/an/an/an/an/an/a
Celgene Quanticel Research Inc
US Patent
Assay Description
The enzymatic assay of Jarid1A activity is based upon Time Resolved-Fluorescence Resonance Energy Transfer (TR-FRET) detection. The ability of test c...
US Patent US10336727 (2019)
BindingDB Entry DOI: 10.7270/Q2571FBT
Lysine-specific demethylase 5B
(Homo sapiens (Human))
BDBM277740
(3-{[1-(cyclopropylmethyl)-5-methyl-1H-indazol-3-yl...)
Show SMILES Cc1ccc2n(CC3CC3)nc(Nc3cnccc3C(O)=O)c2c1
Show InChI InChI=1S/C18H18N4O2/c1-11-2-5-16-14(8-11)17(21-22(16)10-12-3-4-12)20-15-9-19-7-6-13(15)18(23)24/h2,5-9,12H,3-4,10H2,1H3,(H,20,21)(H,23,24)
US Patent
n/an/a<100n/an/an/an/an/an/a
Celgene Quanticel Research Inc
US Patent
Assay Description
The ability of test compounds to inhibit the activity of Jarid1B was determined in 384-well plate format under the following reaction conditions: 0.8...
US Patent US10336727 (2019)
BindingDB Entry DOI: 10.7270/Q2571FBT
Lysine-specific demethylase 5B
(Homo sapiens (Human))
BDBM277740
(3-{[1-(cyclopropylmethyl)-5-methyl-1H-indazol-3-yl...)
Show SMILES Cc1ccc2n(CC3CC3)nc(Nc3cnccc3C(O)=O)c2c1
Show InChI InChI=1S/C18H18N4O2/c1-11-2-5-16-14(8-11)17(21-22(16)10-12-3-4-12)20-15-9-19-7-6-13(15)18(23)24/h2,5-9,12H,3-4,10H2,1H3,(H,20,21)(H,23,24)
US Patent
n/an/a<100n/an/an/an/an/an/a
CELGENE QUANTICEL RESEARCH, INC.
US Patent
Assay Description
The ability of test compounds to inhibit the activity of Jarid1B was determined in 384-well plate format under the following reaction conditions: 0.8...
US Patent US9617242 (2017)
BindingDB Entry DOI: 10.7270/Q2XK8HM5