BDBM277747 3-{[5-fluoro-1-(5-hydroxypentyl)-1H-indazol-3-yl]amino}pyridine-4-carboxylic acid::US10040779, Example 44::US10336727, Example 44::US9617242, Example 44
SMILES: OCCCCCn1nc(Nc2cnccc2C(O)=O)c2cc(F)ccc12
InChI Key: InChIKey=AEPRJEGBYCRNTO-UHFFFAOYSA-N
Data: 9 IC50
Activity Spreadsheet -- Enzyme Inhibition Constant Data from BindingDB
Found 9 hits for monomerid = 277747
Trg + Lig
Ki
nM
ΔG°
kcal/mole
IC50
nM
Kd
nM
EC50/IC50
nM
koff
s-1
kon
M-1s-1
pHTemp
°C
Lysine-specific demethylase 5A
(Homo sapiens (Human))
BDBM277747
(3-{[5-fluoro-1-(5-hydroxypentyl)-1H-indazol-3-yl]a...)
Show SMILES OCCCCCn1nc(Nc2cnccc2C(O)=O)c2cc(F)ccc12
Show InChI InChI=1S/C18H19FN4O3/c19-12-4-5-16-14(10-12)17(22-23(16)8-2-1-3-9-24)21-15-11-20-7-6-13(15)18(25)26/h4-7,10-11,24H,1-3,8-9H2,(H,21,22)(H,25,26)
Reactome pathway
US Patent
n/an/a<0.100n/an/an/an/an/an/a
Celgene Quanticel Research, Inc.
US Patent
Assay Description
The enzymatic assay of Jarid1A activity is based upon Time Resolved-Fluorescence Resonance Energy Transfer (TR-FRET) detection. The ability of test c...
US Patent US10040779 (2018)
BindingDB Entry DOI: 10.7270/Q26H4KF1
Lysine-specific demethylase 5B
(Homo sapiens (Human))
BDBM277747
(3-{[5-fluoro-1-(5-hydroxypentyl)-1H-indazol-3-yl]a...)
Show SMILES OCCCCCn1nc(Nc2cnccc2C(O)=O)c2cc(F)ccc12
Show InChI InChI=1S/C18H19FN4O3/c19-12-4-5-16-14(10-12)17(22-23(16)8-2-1-3-9-24)21-15-11-20-7-6-13(15)18(25)26/h4-7,10-11,24H,1-3,8-9H2,(H,21,22)(H,25,26)
US Patent
n/an/a<0.100n/an/an/an/an/an/a
Celgene Quanticel Research, Inc.
US Patent
Assay Description
The ability of test compounds to inhibit the activity of Jarid1B was determined in 384-well plate format under the following reaction conditions: 0.8...
US Patent US10040779 (2018)
BindingDB Entry DOI: 10.7270/Q26H4KF1
Lysine-specific demethylase 4C
(Homo sapiens (Human))
BDBM277747
(3-{[5-fluoro-1-(5-hydroxypentyl)-1H-indazol-3-yl]a...)
Show SMILES OCCCCCn1nc(Nc2cnccc2C(O)=O)c2cc(F)ccc12
Show InChI InChI=1S/C18H19FN4O3/c19-12-4-5-16-14(10-12)17(22-23(16)8-2-1-3-9-24)21-15-11-20-7-6-13(15)18(25)26/h4-7,10-11,24H,1-3,8-9H2,(H,21,22)(H,25,26)
US Patent
n/an/a<0.100n/an/an/an/an/an/a
Celgene Quanticel Research, Inc.
US Patent
Assay Description
The ability of test compounds to inhibit the activity of JMJD2C was determined in 384-well plate format under the following reaction conditions: 0.3 ...
US Patent US10040779 (2018)
BindingDB Entry DOI: 10.7270/Q26H4KF1
Lysine-specific demethylase 5A
(Homo sapiens (Human))
BDBM277747
(3-{[5-fluoro-1-(5-hydroxypentyl)-1H-indazol-3-yl]a...)
Show SMILES OCCCCCn1nc(Nc2cnccc2C(O)=O)c2cc(F)ccc12
Show InChI InChI=1S/C18H19FN4O3/c19-12-4-5-16-14(10-12)17(22-23(16)8-2-1-3-9-24)21-15-11-20-7-6-13(15)18(25)26/h4-7,10-11,24H,1-3,8-9H2,(H,21,22)(H,25,26)
Reactome pathway
US Patent
n/an/a<100n/an/an/an/an/an/a
CELGENE QUANTICEL RESEARCH, INC.
US Patent
Assay Description
The enzymatic assay of Jarid1A activity is based upon Time Resolved-Fluorescence Resonance Energy Transfer (TR-FRET) detection. The ability of test c...
US Patent US9617242 (2017)
BindingDB Entry DOI: 10.7270/Q2XK8HM5
Lysine-specific demethylase 4C
(Homo sapiens (Human))
BDBM277747
(3-{[5-fluoro-1-(5-hydroxypentyl)-1H-indazol-3-yl]a...)
Show SMILES OCCCCCn1nc(Nc2cnccc2C(O)=O)c2cc(F)ccc12
Show InChI InChI=1S/C18H19FN4O3/c19-12-4-5-16-14(10-12)17(22-23(16)8-2-1-3-9-24)21-15-11-20-7-6-13(15)18(25)26/h4-7,10-11,24H,1-3,8-9H2,(H,21,22)(H,25,26)
US Patent
n/an/a<100n/an/an/an/an/an/a
Celgene Quanticel Research Inc
US Patent
Assay Description
The ability of test compounds to inhibit the activity of JMJD2C was determined in 384-well plate format under the following reaction conditions: 0.3 ...
US Patent US10336727 (2019)
BindingDB Entry DOI: 10.7270/Q2571FBT
Lysine-specific demethylase 4C
(Homo sapiens (Human))
BDBM277747
(3-{[5-fluoro-1-(5-hydroxypentyl)-1H-indazol-3-yl]a...)
Show SMILES OCCCCCn1nc(Nc2cnccc2C(O)=O)c2cc(F)ccc12
Show InChI InChI=1S/C18H19FN4O3/c19-12-4-5-16-14(10-12)17(22-23(16)8-2-1-3-9-24)21-15-11-20-7-6-13(15)18(25)26/h4-7,10-11,24H,1-3,8-9H2,(H,21,22)(H,25,26)
US Patent
n/an/a<100n/an/an/an/an/an/a
CELGENE QUANTICEL RESEARCH, INC.
US Patent
Assay Description
The ability of test compounds to inhibit the activity of JMJD2C was determined in 384-well plate format under the following reaction conditions: 0.3 ...
US Patent US9617242 (2017)
BindingDB Entry DOI: 10.7270/Q2XK8HM5
Lysine-specific demethylase 5A
(Homo sapiens (Human))
BDBM277747
(3-{[5-fluoro-1-(5-hydroxypentyl)-1H-indazol-3-yl]a...)
Show SMILES OCCCCCn1nc(Nc2cnccc2C(O)=O)c2cc(F)ccc12
Show InChI InChI=1S/C18H19FN4O3/c19-12-4-5-16-14(10-12)17(22-23(16)8-2-1-3-9-24)21-15-11-20-7-6-13(15)18(25)26/h4-7,10-11,24H,1-3,8-9H2,(H,21,22)(H,25,26)
Reactome pathway
US Patent
n/an/a<100n/an/an/an/an/an/a
Celgene Quanticel Research Inc
US Patent
Assay Description
The enzymatic assay of Jarid1A activity is based upon Time Resolved-Fluorescence Resonance Energy Transfer (TR-FRET) detection. The ability of test c...
US Patent US10336727 (2019)
BindingDB Entry DOI: 10.7270/Q2571FBT
Lysine-specific demethylase 5B
(Homo sapiens (Human))
BDBM277747
(3-{[5-fluoro-1-(5-hydroxypentyl)-1H-indazol-3-yl]a...)
Show SMILES OCCCCCn1nc(Nc2cnccc2C(O)=O)c2cc(F)ccc12
Show InChI InChI=1S/C18H19FN4O3/c19-12-4-5-16-14(10-12)17(22-23(16)8-2-1-3-9-24)21-15-11-20-7-6-13(15)18(25)26/h4-7,10-11,24H,1-3,8-9H2,(H,21,22)(H,25,26)
US Patent
n/an/a<100n/an/an/an/an/an/a
Celgene Quanticel Research Inc
US Patent
Assay Description
The ability of test compounds to inhibit the activity of Jarid1B was determined in 384-well plate format under the following reaction conditions: 0.8...
US Patent US10336727 (2019)
BindingDB Entry DOI: 10.7270/Q2571FBT
Lysine-specific demethylase 5B
(Homo sapiens (Human))
BDBM277747
(3-{[5-fluoro-1-(5-hydroxypentyl)-1H-indazol-3-yl]a...)
Show SMILES OCCCCCn1nc(Nc2cnccc2C(O)=O)c2cc(F)ccc12
Show InChI InChI=1S/C18H19FN4O3/c19-12-4-5-16-14(10-12)17(22-23(16)8-2-1-3-9-24)21-15-11-20-7-6-13(15)18(25)26/h4-7,10-11,24H,1-3,8-9H2,(H,21,22)(H,25,26)
US Patent
n/an/a<100n/an/an/an/an/an/a
CELGENE QUANTICEL RESEARCH, INC.
US Patent
Assay Description
The ability of test compounds to inhibit the activity of Jarid1B was determined in 384-well plate format under the following reaction conditions: 0.8...
US Patent US9617242 (2017)
BindingDB Entry DOI: 10.7270/Q2XK8HM5