BDBM277773 N-cyano-3-({5-fluoro-1-[(3S)-tetrahydrofuran-3-yl]-1H-indazol-3-yl}amino)pyridine-4-carboxamide::US10040779, Example 70::US10336727, Example 70::US9617242, Example 70
SMILES: Fc1ccc2n(nc(Nc3cnccc3C(=O)NC#N)c2c1)[C@H]1CCOC1
InChI Key: InChIKey=CIVLISPQADTQPF-LBPRGKRZSA-N
Data: 9 IC50
Activity Spreadsheet -- Enzyme Inhibition Constant Data from BindingDB
Found 9 hits for monomerid = 277773
Trg + Lig
Ki
nM
ΔG°
kcal/mole
IC50
nM
Kd
nM
EC50/IC50
nM
koff
s-1
kon
M-1s-1
pHTemp
°C
Lysine-specific demethylase 5A
(Homo sapiens (Human))
BDBM277773
(N-cyano-3-({5-fluoro-1-[(3S)-tetrahydrofuran-3-yl]...)
Show SMILES Fc1ccc2n(nc(Nc3cnccc3C(=O)NC#N)c2c1)[C@H]1CCOC1 |r|
Show InChI InChI=1S/C18H15FN6O2/c19-11-1-2-16-14(7-11)17(24-25(16)12-4-6-27-9-12)23-15-8-21-5-3-13(15)18(26)22-10-20/h1-3,5,7-8,12H,4,6,9H2,(H,22,26)(H,23,24)/t12-/m0/s1
Reactome pathway
US Patent
n/an/a<0.100n/an/an/an/an/an/a
Celgene Quanticel Research, Inc.
US Patent
Assay Description
The enzymatic assay of Jarid1A activity is based upon Time Resolved-Fluorescence Resonance Energy Transfer (TR-FRET) detection. The ability of test c...
US Patent US10040779 (2018)
BindingDB Entry DOI: 10.7270/Q26H4KF1
Lysine-specific demethylase 5B
(Homo sapiens (Human))
BDBM277773
(N-cyano-3-({5-fluoro-1-[(3S)-tetrahydrofuran-3-yl]...)
Show SMILES Fc1ccc2n(nc(Nc3cnccc3C(=O)NC#N)c2c1)[C@H]1CCOC1 |r|
Show InChI InChI=1S/C18H15FN6O2/c19-11-1-2-16-14(7-11)17(24-25(16)12-4-6-27-9-12)23-15-8-21-5-3-13(15)18(26)22-10-20/h1-3,5,7-8,12H,4,6,9H2,(H,22,26)(H,23,24)/t12-/m0/s1
US Patent
n/an/a<0.100n/an/an/an/an/an/a
Celgene Quanticel Research, Inc.
US Patent
Assay Description
The ability of test compounds to inhibit the activity of Jarid1B was determined in 384-well plate format under the following reaction conditions: 0.8...
US Patent US10040779 (2018)
BindingDB Entry DOI: 10.7270/Q26H4KF1
Lysine-specific demethylase 4C
(Homo sapiens (Human))
BDBM277773
(N-cyano-3-({5-fluoro-1-[(3S)-tetrahydrofuran-3-yl]...)
Show SMILES Fc1ccc2n(nc(Nc3cnccc3C(=O)NC#N)c2c1)[C@H]1CCOC1 |r|
Show InChI InChI=1S/C18H15FN6O2/c19-11-1-2-16-14(7-11)17(24-25(16)12-4-6-27-9-12)23-15-8-21-5-3-13(15)18(26)22-10-20/h1-3,5,7-8,12H,4,6,9H2,(H,22,26)(H,23,24)/t12-/m0/s1
US Patent
n/an/a 50n/an/an/an/an/an/a
Celgene Quanticel Research, Inc.
US Patent
Assay Description
The ability of test compounds to inhibit the activity of JMJD2C was determined in 384-well plate format under the following reaction conditions: 0.3 ...
US Patent US10040779 (2018)
BindingDB Entry DOI: 10.7270/Q26H4KF1
Lysine-specific demethylase 5A
(Homo sapiens (Human))
BDBM277773
(N-cyano-3-({5-fluoro-1-[(3S)-tetrahydrofuran-3-yl]...)
Show SMILES Fc1ccc2n(nc(Nc3cnccc3C(=O)NC#N)c2c1)[C@H]1CCOC1 |r|
Show InChI InChI=1S/C18H15FN6O2/c19-11-1-2-16-14(7-11)17(24-25(16)12-4-6-27-9-12)23-15-8-21-5-3-13(15)18(26)22-10-20/h1-3,5,7-8,12H,4,6,9H2,(H,22,26)(H,23,24)/t12-/m0/s1
Reactome pathway
US Patent
n/an/a<100n/an/an/an/an/an/a
CELGENE QUANTICEL RESEARCH, INC.
US Patent
Assay Description
The enzymatic assay of Jarid1A activity is based upon Time Resolved-Fluorescence Resonance Energy Transfer (TR-FRET) detection. The ability of test c...
US Patent US9617242 (2017)
BindingDB Entry DOI: 10.7270/Q2XK8HM5
Lysine-specific demethylase 4C
(Homo sapiens (Human))
BDBM277773
(N-cyano-3-({5-fluoro-1-[(3S)-tetrahydrofuran-3-yl]...)
Show SMILES Fc1ccc2n(nc(Nc3cnccc3C(=O)NC#N)c2c1)[C@H]1CCOC1 |r|
Show InChI InChI=1S/C18H15FN6O2/c19-11-1-2-16-14(7-11)17(24-25(16)12-4-6-27-9-12)23-15-8-21-5-3-13(15)18(26)22-10-20/h1-3,5,7-8,12H,4,6,9H2,(H,22,26)(H,23,24)/t12-/m0/s1
US Patent
n/an/a 5.50E+3n/an/an/an/an/an/a
Celgene Quanticel Research Inc
US Patent
Assay Description
The ability of test compounds to inhibit the activity of JMJD2C was determined in 384-well plate format under the following reaction conditions: 0.3 ...
US Patent US10336727 (2019)
BindingDB Entry DOI: 10.7270/Q2571FBT
Lysine-specific demethylase 4C
(Homo sapiens (Human))
BDBM277773
(N-cyano-3-({5-fluoro-1-[(3S)-tetrahydrofuran-3-yl]...)
Show SMILES Fc1ccc2n(nc(Nc3cnccc3C(=O)NC#N)c2c1)[C@H]1CCOC1 |r|
Show InChI InChI=1S/C18H15FN6O2/c19-11-1-2-16-14(7-11)17(24-25(16)12-4-6-27-9-12)23-15-8-21-5-3-13(15)18(26)22-10-20/h1-3,5,7-8,12H,4,6,9H2,(H,22,26)(H,23,24)/t12-/m0/s1
US Patent
n/an/a 5.50E+3n/an/an/an/an/an/a
CELGENE QUANTICEL RESEARCH, INC.
US Patent
Assay Description
The ability of test compounds to inhibit the activity of JMJD2C was determined in 384-well plate format under the following reaction conditions: 0.3 ...
US Patent US9617242 (2017)
BindingDB Entry DOI: 10.7270/Q2XK8HM5
Lysine-specific demethylase 5A
(Homo sapiens (Human))
BDBM277773
(N-cyano-3-({5-fluoro-1-[(3S)-tetrahydrofuran-3-yl]...)
Show SMILES Fc1ccc2n(nc(Nc3cnccc3C(=O)NC#N)c2c1)[C@H]1CCOC1 |r|
Show InChI InChI=1S/C18H15FN6O2/c19-11-1-2-16-14(7-11)17(24-25(16)12-4-6-27-9-12)23-15-8-21-5-3-13(15)18(26)22-10-20/h1-3,5,7-8,12H,4,6,9H2,(H,22,26)(H,23,24)/t12-/m0/s1
Reactome pathway
US Patent
n/an/a<100n/an/an/an/an/an/a
Celgene Quanticel Research Inc
US Patent
Assay Description
The enzymatic assay of Jarid1A activity is based upon Time Resolved-Fluorescence Resonance Energy Transfer (TR-FRET) detection. The ability of test c...
US Patent US10336727 (2019)
BindingDB Entry DOI: 10.7270/Q2571FBT
Lysine-specific demethylase 5B
(Homo sapiens (Human))
BDBM277773
(N-cyano-3-({5-fluoro-1-[(3S)-tetrahydrofuran-3-yl]...)
Show SMILES Fc1ccc2n(nc(Nc3cnccc3C(=O)NC#N)c2c1)[C@H]1CCOC1 |r|
Show InChI InChI=1S/C18H15FN6O2/c19-11-1-2-16-14(7-11)17(24-25(16)12-4-6-27-9-12)23-15-8-21-5-3-13(15)18(26)22-10-20/h1-3,5,7-8,12H,4,6,9H2,(H,22,26)(H,23,24)/t12-/m0/s1
US Patent
n/an/a<100n/an/an/an/an/an/a
Celgene Quanticel Research Inc
US Patent
Assay Description
The ability of test compounds to inhibit the activity of Jarid1B was determined in 384-well plate format under the following reaction conditions: 0.8...
US Patent US10336727 (2019)
BindingDB Entry DOI: 10.7270/Q2571FBT
Lysine-specific demethylase 5B
(Homo sapiens (Human))
BDBM277773
(N-cyano-3-({5-fluoro-1-[(3S)-tetrahydrofuran-3-yl]...)
Show SMILES Fc1ccc2n(nc(Nc3cnccc3C(=O)NC#N)c2c1)[C@H]1CCOC1 |r|
Show InChI InChI=1S/C18H15FN6O2/c19-11-1-2-16-14(7-11)17(24-25(16)12-4-6-27-9-12)23-15-8-21-5-3-13(15)18(26)22-10-20/h1-3,5,7-8,12H,4,6,9H2,(H,22,26)(H,23,24)/t12-/m0/s1
US Patent
n/an/a<100n/an/an/an/an/an/a
CELGENE QUANTICEL RESEARCH, INC.
US Patent
Assay Description
The ability of test compounds to inhibit the activity of Jarid1B was determined in 384-well plate format under the following reaction conditions: 0.8...
US Patent US9617242 (2017)
BindingDB Entry DOI: 10.7270/Q2XK8HM5