BDBM27810 2-fluoro-6-{[2-({5-methoxy-1-[3-(morpholin-4-yl)propanoyl]-2,3-dihydro-1H-indol-6-yl}amino)-7H-pyrrolo[2,3-d]pyrimidin-4-yl]amino}benzamide::pyrrolo[2,3-d]pyrimidine deriv., 33
SMILES: COc1cc2CCN(C(=O)CCN3CCOCC3)c2cc1Nc1nc(Nc2cccc(F)c2C(N)=O)c2cc[nH]c2n1
InChI Key: InChIKey=VEKQRWMLMKCRSW-UHFFFAOYSA-N
Data: 2 IC50
Activity Spreadsheet -- Enzyme Inhibition Constant Data from BindingDB
Found 2 hits for monomerid = 27810
Trg + Lig
Ki
nM
ΔG°
kcal/mole
IC50
nM
Kd
nM
EC50/IC50
nM
koff
s-1
kon
M-1s-1
pHTemp
°C
Mitogen-activated protein kinase 8
(Homo sapiens (Human))
BDBM27810
(2-fluoro-6-{[2-({5-methoxy-1-[3-(morpholin-4-yl)pr...)
Show SMILES COc1cc2CCN(C(=O)CCN3CCOCC3)c2cc1Nc1nc(Nc2cccc(F)c2C(N)=O)c2cc[nH]c2n1
Show InChI InChI=1S/C29H31FN8O4/c1-41-23-15-17-6-10-38(24(39)7-9-37-11-13-42-14-12-37)22(17)16-21(23)34-29-35-27-18(5-8-32-27)28(36-29)33-20-4-2-3-19(30)25(20)26(31)40/h2-5,8,15-16H,6-7,9-14H2,1H3,(H2,31,40)(H3,32,33,34,35,36)
NCI pathway
Reactome pathway
n/an/a 251n/an/an/an/an/an/a
GSK
Assay Description
Assays are performed in 384-well microtiter plates in reaction buffer containing substrate GST-biotin-C-JUN, ATP, and purified activated JNK1alpha1 i...
Bioorg Med Chem Lett 19: 360-4 (2009)
Article DOI: 10.1016/j.bmcl.2008.11.077
BindingDB Entry DOI: 10.7270/Q2NZ85ZT
Insulin-like growth factor I receptor
(Homo sapiens (Human))
BDBM27810
(2-fluoro-6-{[2-({5-methoxy-1-[3-(morpholin-4-yl)pr...)
Show SMILES COc1cc2CCN(C(=O)CCN3CCOCC3)c2cc1Nc1nc(Nc2cccc(F)c2C(N)=O)c2cc[nH]c2n1
Show InChI InChI=1S/C29H31FN8O4/c1-41-23-15-17-6-10-38(24(39)7-9-37-11-13-42-14-12-37)22(17)16-21(23)34-29-35-27-18(5-8-32-27)28(36-29)33-20-4-2-3-19(30)25(20)26(31)40/h2-5,8,15-16H,6-7,9-14H2,1H3,(H2,31,40)(H3,32,33,34,35,36)
Reactome pathway
n/an/a 6n/an/an/an/an/an/a
GSK
Assay Description
Assays are performed in 384-well microtiter plates in reaction buffer containing biotinylated substrate, ATP, and purified activated GST-IGF-1R in th...
Bioorg Med Chem Lett 19: 360-4 (2009)
Article DOI: 10.1016/j.bmcl.2008.11.077
BindingDB Entry DOI: 10.7270/Q2NZ85ZT