BDBM278275 2-(((3R,4S)-3-fluoro-1-((S)-2-hydroxypropanoyl)piperidin-4-yl)oxy)-5-(4-((4-(piperazin-1-yl)phenyl)amino)-1,3,5-triazin-2-yl)benzonitrile::US10040781, Example 497::US10253019, Example 497
SMILES: C[C@H](O)C(=O)N1CC[C@H](Oc2ccc(cc2C#N)-c2ncnc(Nc3ccc(cc3)N3CCNCC3)n2)[C@H](F)C1
InChI Key: InChIKey=NBCMQEJIXBJWMS-UODBTFMRSA-N
Data: 6 IC50
Activity Spreadsheet -- Enzyme Inhibition Constant Data from BindingDB
Found 6 hits for monomerid = 278275
Trg + Lig
Ki
nM
ΔG°
kcal/mole
IC50
nM
Kd
nM
EC50/IC50
nM
koff
s-1
kon
M-1s-1
pHTemp
°C
Protein cereblon/Serine/threonine-protein kinase TBK1
(Homo sapiens (Human))
BDBM278275
(2-(((3R,4S)-3-fluoro-1-((S)-2-hydroxypropanoyl)pip...)
Show SMILES C[C@H](O)C(=O)N1CC[C@H](Oc2ccc(cc2C#N)-c2ncnc(Nc3ccc(cc3)N3CCNCC3)n2)[C@H](F)C1 |r|
Show InChI InChI=1S/C28H31FN8O3/c1-18(38)27(39)37-11-8-25(23(29)16-37)40-24-7-2-19(14-20(24)15-30)26-32-17-33-28(35-26)34-21-3-5-22(6-4-21)36-12-9-31-10-13-36/h2-7,14,17-18,23,25,31,38H,8-13,16H2,1H3,(H,32,33,34,35)/t18-,23+,25-/m0/s1
US Patent
n/an/a 1.00E+3n/an/an/an/a7.0n/a
Gilead Sciences, Inc.
US Patent
Assay Description
Enzymatic activity of IKKε and TBK1 was measured using a homogeneous time resolved fluorescence resonance energy transfer (TR-FRET) assay that m...
US Patent US10040781 (2018)
BindingDB Entry DOI: 10.7270/Q22V2J41
Inhibitor of nuclear factor kappa-B kinase subunit epsilon
(Homo sapiens (Human))
BDBM278275
(2-(((3R,4S)-3-fluoro-1-((S)-2-hydroxypropanoyl)pip...)
Show SMILES C[C@H](O)C(=O)N1CC[C@H](Oc2ccc(cc2C#N)-c2ncnc(Nc3ccc(cc3)N3CCNCC3)n2)[C@H](F)C1 |r|
Show InChI InChI=1S/C28H31FN8O3/c1-18(38)27(39)37-11-8-25(23(29)16-37)40-24-7-2-19(14-20(24)15-30)26-32-17-33-28(35-26)34-21-3-5-22(6-4-21)36-12-9-31-10-13-36/h2-7,14,17-18,23,25,31,38H,8-13,16H2,1H3,(H,32,33,34,35)/t18-,23+,25-/m0/s1
Reactome pathway
US Patent
n/an/a<1n/an/an/an/a7.0n/a
Gilead Sciences, Inc.
US Patent
Assay Description
Enzymatic activity of IKKε and TBK1 was measured using a homogeneous time resolved fluorescence resonance energy transfer (TR-FRET) assay that m...
US Patent US10040781 (2018)
BindingDB Entry DOI: 10.7270/Q22V2J41
Tyrosine-protein kinase JAK2
(Homo sapiens (Human))
BDBM278275
(2-(((3R,4S)-3-fluoro-1-((S)-2-hydroxypropanoyl)pip...)
Show SMILES C[C@H](O)C(=O)N1CC[C@H](Oc2ccc(cc2C#N)-c2ncnc(Nc3ccc(cc3)N3CCNCC3)n2)[C@H](F)C1 |r|
Show InChI InChI=1S/C28H31FN8O3/c1-18(38)27(39)37-11-8-25(23(29)16-37)40-24-7-2-19(14-20(24)15-30)26-32-17-33-28(35-26)34-21-3-5-22(6-4-21)36-12-9-31-10-13-36/h2-7,14,17-18,23,25,31,38H,8-13,16H2,1H3,(H,32,33,34,35)/t18-,23+,25-/m0/s1
Reactome pathway
US Patent
n/an/a 358n/an/an/an/an/an/a
University of Rome La Sapienza
Assay Description
Enzymatic activity of hJAK2 was measured using a LANCE homogeneous time resolved fluorescence resonance energy transfer (TR-FRET) assay that monitors...
J Med Chem 50: 6554-69 (2007)
BindingDB Entry DOI: 10.7270/Q2Q52RXT
Protein cereblon/Serine/threonine-protein kinase TBK1
(Homo sapiens (Human))
BDBM278275
(2-(((3R,4S)-3-fluoro-1-((S)-2-hydroxypropanoyl)pip...)
Show SMILES C[C@H](O)C(=O)N1CC[C@H](Oc2ccc(cc2C#N)-c2ncnc(Nc3ccc(cc3)N3CCNCC3)n2)[C@H](F)C1 |r|
Show InChI InChI=1S/C28H31FN8O3/c1-18(38)27(39)37-11-8-25(23(29)16-37)40-24-7-2-19(14-20(24)15-30)26-32-17-33-28(35-26)34-21-3-5-22(6-4-21)36-12-9-31-10-13-36/h2-7,14,17-18,23,25,31,38H,8-13,16H2,1H3,(H,32,33,34,35)/t18-,23+,25-/m0/s1
US Patent
n/an/a 1n/an/an/an/an/an/a
University of Rome La Sapienza
Assay Description
Enzymatic activity of IKKε and TBK1 was measured using a homogeneous time resolved fluorescence resonance energy transfer (TR-FRET) assay that m...
J Med Chem 50: 6554-69 (2007)
BindingDB Entry DOI: 10.7270/Q2Q52RXT
Inhibitor of nuclear factor kappa-B kinase subunit epsilon
(Homo sapiens (Human))
BDBM278275
(2-(((3R,4S)-3-fluoro-1-((S)-2-hydroxypropanoyl)pip...)
Show SMILES C[C@H](O)C(=O)N1CC[C@H](Oc2ccc(cc2C#N)-c2ncnc(Nc3ccc(cc3)N3CCNCC3)n2)[C@H](F)C1 |r|
Show InChI InChI=1S/C28H31FN8O3/c1-18(38)27(39)37-11-8-25(23(29)16-37)40-24-7-2-19(14-20(24)15-30)26-32-17-33-28(35-26)34-21-3-5-22(6-4-21)36-12-9-31-10-13-36/h2-7,14,17-18,23,25,31,38H,8-13,16H2,1H3,(H,32,33,34,35)/t18-,23+,25-/m0/s1
Reactome pathway
US Patent
n/an/a<1n/an/an/an/an/an/a
University of Rome La Sapienza
Assay Description
Enzymatic activity of IKKε and TBK1 was measured using a homogeneous time resolved fluorescence resonance energy transfer (TR-FRET) assay that m...
J Med Chem 50: 6554-69 (2007)
BindingDB Entry DOI: 10.7270/Q2Q52RXT
Tyrosine-protein kinase JAK2
(Homo sapiens (Human))
BDBM278275
(2-(((3R,4S)-3-fluoro-1-((S)-2-hydroxypropanoyl)pip...)
Show SMILES C[C@H](O)C(=O)N1CC[C@H](Oc2ccc(cc2C#N)-c2ncnc(Nc3ccc(cc3)N3CCNCC3)n2)[C@H](F)C1 |r|
Show InChI InChI=1S/C28H31FN8O3/c1-18(38)27(39)37-11-8-25(23(29)16-37)40-24-7-2-19(14-20(24)15-30)26-32-17-33-28(35-26)34-21-3-5-22(6-4-21)36-12-9-31-10-13-36/h2-7,14,17-18,23,25,31,38H,8-13,16H2,1H3,(H,32,33,34,35)/t18-,23+,25-/m0/s1
Reactome pathway
US Patent
n/an/a 3.58E+5n/an/an/an/a7.5n/a
Gilead Sciences, Inc.
US Patent
Assay Description
Enzymatic activity of hJAK2 was measured using a LANCE homogeneous time resolved fluorescence resonance energy transfer (TR-FRET) assay that monitors...
US Patent US10040781 (2018)
BindingDB Entry DOI: 10.7270/Q22V2J41