BDBM278436 US10040788, Example 23(a)::US10294221, Example 23(b)
SMILES: CO[C@H](C(=O)Nc1nnc(N[C@@H]2CCN(C2)c2cncnn2)s1)c1cccc(OC(F)F)c1
InChI Key: InChIKey=UXUZEXMPUQWNOZ-DOMZBBRYSA-N
Data: 2 IC50
Activity Spreadsheet -- Enzyme Inhibition Constant Data from BindingDB
Found 2 hits for monomerid = 278436
Trg + Lig
Ki
nM
ΔG°
kcal/mole
IC50
nM
Kd
nM
EC50/IC50
nM
koff
s-1
kon
M-1s-1
pHTemp
°C
Glutaminase kidney isoform, mitochondrial
(Homo sapiens (Human))
BDBM278436
(US10040788, Example 23(a) | US10294221, Example 23...)
Show SMILES CO[C@H](C(=O)Nc1nnc(N[C@@H]2CCN(C2)c2cncnn2)s1)c1cccc(OC(F)F)c1 |r|
Show InChI InChI=1S/C19H20F2N8O3S/c1-31-15(11-3-2-4-13(7-11)32-17(20)21)16(30)25-19-28-27-18(33-19)24-12-5-6-29(9-12)14-8-22-10-23-26-14/h2-4,7-8,10,12,15,17H,5-6,9H2,1H3,(H,24,27)(H,25,28,30)/t12-,15+/m1/s1
US Patent
n/an/a 162n/an/an/an/an/an/a
Bristol-Myers Squibb Company
Assay Description
A Glutamate Oxidase/AmplexRed coupled assay was used to measure the ability of compounds to bind to and inhibit the activity of GLS1 in vitro. 6His t...
Bioorg Med Chem Lett 18: 1577-82 (2008)
BindingDB Entry DOI: 10.7270/Q2MK6G78
Glutaminase kidney isoform, mitochondrial
(Homo sapiens (Human))
BDBM278436
(US10040788, Example 23(a) | US10294221, Example 23...)
Show SMILES CO[C@H](C(=O)Nc1nnc(N[C@@H]2CCN(C2)c2cncnn2)s1)c1cccc(OC(F)F)c1 |r|
Show InChI InChI=1S/C19H20F2N8O3S/c1-31-15(11-3-2-4-13(7-11)32-17(20)21)16(30)25-19-28-27-18(33-19)24-12-5-6-29(9-12)14-8-22-10-23-26-14/h2-4,7-8,10,12,15,17H,5-6,9H2,1H3,(H,24,27)(H,25,28,30)/t12-,15+/m1/s1
US Patent
n/an/a 27.6n/an/an/an/a7.8n/a
AstraZeneca AB; Cancer Research Technology Limited
US Patent
Assay Description
A Glutamate Oxidase/AmplexRed coupled assay was used to measure the ability of compounds to bind to and inhibit the activity of GLS1 in vitro. 6His t...
US Patent US10040788 (2018)
BindingDB Entry DOI: 10.7270/Q2Z321PG