BDBM27859 3-hydroxy-N-[(4-phenylphenyl)methyl]-4-sulfanylidene-4H-pyran-2-carboxamide::hydroxypyrothione amide, 1b
SMILES: Oc1c(occc1=S)C(=O)NCc1ccc(cc1)-c1ccccc1
InChI Key: InChIKey=FLLRTZCPHNPPBY-UHFFFAOYSA-N
Data: 1 IC50
Activity Spreadsheet -- Enzyme Inhibition Constant Data from BindingDB
Found 1 hit for monomerid = 27859
Trg + Lig
Ki
nM
ΔG°
kcal/mole
IC50
nM
Kd
nM
EC50/IC50
nM
koff
s-1
kon
M-1s-1
pHTemp
°C
Anthrax Lethal Factor (LF)
(Bacillus anthracis)
BDBM27859
(3-hydroxy-N-[(4-phenylphenyl)methyl]-4-sulfanylide...)
Show SMILES Oc1c(occc1=S)C(=O)NCc1ccc(cc1)-c1ccccc1
Show InChI InChI=1S/C19H15NO3S/c21-17-16(24)10-11-23-18(17)19(22)20-12-13-6-8-15(9-7-13)14-4-2-1-3-5-14/h1-11,21H,12H2,(H,20,22)
NCI pathway
Reactome pathway
n/an/a 1.32E+4n/an/an/an/a7.025
Howard Hughes Medical Institute
Assay Description
Fluorescence peptide cleavage assay was performed in a 96-well plate. Each reaction contained fluorogenic peptide substrate, LF, and small-molecule i...
J Med Chem 52: 1063-74 (2009)
Article DOI: 10.1021/jm8013212
BindingDB Entry DOI: 10.7270/Q2DJ5CZV