null
SMILES: OC(=O)C(F)(F)F.Cn1cc(NC(=O)c2ccc3ccc(N[C@@H]4CCCNC4)nn23)c(n1)C(F)F
InChI Key: InChIKey=MYABKSAFJRTILT-RFVHGSKJSA-N
Activity Spreadsheet -- Enzyme Inhibition Constant Data from BindingDB
Found 1 hit for monomerid = 278719
Trg + Lig
Ki
nM
ΔG°
kcal/mole
IC50
nM
Kd
nM
EC50/IC50
nM
koff
s-1
kon
M-1s-1
pHTemp
°C
Interleukin-1 receptor-associated kinase 4
(Homo sapiens (Human))
BDBM278719
(N-[3-(difluoromethyl)- 1-methyl-1H-pyrazol-4- yl]-...)
Show SMILES OC(=O)C(F)(F)F.Cn1cc(NC(=O)c2ccc3ccc(N[C@@H]4CCCNC4)nn23)c(n1)C(F)F |r|
Show InChI InChI=1S/C18H21F2N7O.C2HF3O2/c1-26-10-13(16(25-26)17(19)20)23-18(28)14-6-4-12-5-7-15(24-27(12)14)22-11-3-2-8-21-9-11;3-2(4,5)1(6)7/h4-7,10-11,17,21H,2-3,8-9H2,1H3,(H,22,24)(H,23,28);(H,6,7)/t11-;/m1./s1
Reactome pathway
US Patent
n/an/a 0.900n/an/an/an/a7.2n/a
Merck Sharp & Dohme Corp.
US Patent
Assay Description
The kinase activity of IRAK4 is determined by its ability to catalyze the phosphorylation of a fluorescent polypeptide substrate. The extent of phosp...
US Patent US10040798 (2018)
BindingDB Entry DOI: 10.7270/Q2F191Q7