BDBM27944 uridine derivative, 41::{[(2R,3S,4R,5R)-5-(6-azido-5-fluoro-2,4-dioxo-1,2,3,4-tetrahydropyrimidin-1-yl)-3,4-dihydroxyoxolan-2-yl]methoxy}phosphonic acid
SMILES: O[C@H]1[C@@H](O)[C@@H](O[C@@H]1COP(O)(O)=O)n1c(N=[N+]=[N-])c(F)c(=O)[nH]c1=O
InChI Key: InChIKey=ARRBQQMKVQEOHQ-UMMCILCDSA-N
Data: 1 KI
Activity Spreadsheet -- Enzyme Inhibition Constant Data from BindingDB
Found 1 hit for monomerid = 27944
Trg + Lig
Ki
nM
ΔG°
kcal/mole
IC50
nM
Kd
nM
EC50/IC50
nM
koff
s-1
kon
M-1s-1
pHTemp
°C
Orotidine Monophosphate Decarboxylase (ODCase)
(Methanobacterium thermoautotrophicum)
BDBM27944
(uridine derivative, 41 | {[(2R,3S,4R,5R)-5-(6-azid...)
Show SMILES O[C@H]1[C@@H](O)[C@@H](O[C@@H]1COP(O)(O)=O)n1c(N=[N+]=[N-])c(F)c(=O)[nH]c1=O |r|
Show InChI InChI=1S/C9H11FN5O9P/c10-3-6(13-14-11)15(9(19)12-7(3)18)8-5(17)4(16)2(24-8)1-23-25(20,21)22/h2,4-5,8,16-17H,1H2,(H,12,18,19)(H2,20,21,22)/t2-,4-,5-,8-/m1/s1
360 -9.67n/an/an/an/an/a7.555
Toronto General Research Institute
Assay Description
An enzyme assay method using isothermal titration calorimetry (ITC) was developed to investigate the inhibition kinetics of ODCase. Titrations were p...
J Med Chem 52: 1648-58 (2009)
Article DOI: 10.1021/jm801224t
BindingDB Entry DOI: 10.7270/Q2RR1WJB