BDBM27968 4-[4-(4-amino-3-{2-[(2-methoxyphenyl)methyl]-1H-1,3-benzodiazol-6-yl}-1H-pyrazolo[3,4-d]pyrimidin-1-yl)cyclohexyl]-N,N-dimethylpiperazine-1-carboxamide::substituted pyrazolopyrimidine, 13
SMILES: COc1ccccc1Cc1nc2ccc(cc2[nH]1)-c1nn([C@H]2CC[C@@H](CC2)N2CCN(CC2)C(=O)N(C)C)c2ncnc(N)c12
InChI Key: InChIKey=FHQQNAHMJMQUKJ-RQNOJGIXSA-N
Data: 3 IC50
Activity Spreadsheet -- Enzyme Inhibition Constant Data from BindingDB
Found 3 hits for monomerid = 27968
Trg + Lig
Ki
nM
ΔG°
kcal/mole
IC50
nM
Kd
nM
EC50/IC50
nM
koff
s-1
kon
M-1s-1
pHTemp
°C
Insulin-like growth factor I receptor
(Homo sapiens (Human))
BDBM27968
(4-[4-(4-amino-3-{2-[(2-methoxyphenyl)methyl]-1H-1,...)
Show SMILES COc1ccccc1Cc1nc2ccc(cc2[nH]1)-c1nn([C@H]2CC[C@@H](CC2)N2CCN(CC2)C(=O)N(C)C)c2ncnc(N)c12 |r,wU:24.30,wD:21.23,(8.83,13.92,;7.49,13.15,;7.49,11.61,;8.83,10.84,;8.83,9.3,;7.49,8.53,;6.16,9.3,;6.16,10.84,;4.72,11.39,;3.53,10.41,;2.04,10.8,;1.21,9.5,;-.31,9.25,;-.85,7.81,;.12,6.62,;1.64,6.87,;2.19,8.31,;3.62,8.87,;-.35,5.15,;.55,3.91,;-.35,2.66,;.42,1.33,;-.41,.03,;.29,-1.34,;1.83,-1.41,;2.66,-.11,;1.96,1.26,;2.6,-2.74,;1.94,-4.13,;2.81,-5.4,;4.35,-5.28,;5.01,-3.89,;4.14,-2.62,;5.22,-6.55,;6.75,-6.43,;4.55,-7.94,;4.55,-9.48,;3.05,-7.6,;-1.82,3.14,;-3.15,2.37,;-4.48,3.14,;-4.48,4.68,;-3.15,5.45,;-3.15,6.99,;-1.82,4.68,)|
Show InChI InChI=1S/C33H40N10O2/c1-40(2)33(44)42-16-14-41(15-17-42)23-9-11-24(12-10-23)43-32-29(31(34)35-20-36-32)30(39-43)22-8-13-25-26(18-22)38-28(37-25)19-21-6-4-5-7-27(21)45-3/h4-8,13,18,20,23-24H,9-12,14-17,19H2,1-3H3,(H,37,38)(H2,34,35,36)/t23-,24-
Reactome pathway
n/an/a 69n/an/an/an/a7.522
Abbott Laboratories
Assay Description
Assays were performed in 96-well microtiter plates in reaction buffer containing biotinylated substrate, ATP, and purified kinase in the presence of ...
Bioorg Med Chem Lett 19: 1718-21 (2009)
Article DOI: 10.1016/j.bmcl.2009.01.086
BindingDB Entry DOI: 10.7270/Q2CJ8BTG
Receptor tyrosine-protein kinase erbB-2
(Homo sapiens (Human))
BDBM27968
(4-[4-(4-amino-3-{2-[(2-methoxyphenyl)methyl]-1H-1,...)
Show SMILES COc1ccccc1Cc1nc2ccc(cc2[nH]1)-c1nn([C@H]2CC[C@@H](CC2)N2CCN(CC2)C(=O)N(C)C)c2ncnc(N)c12 |r,wU:24.30,wD:21.23,(8.83,13.92,;7.49,13.15,;7.49,11.61,;8.83,10.84,;8.83,9.3,;7.49,8.53,;6.16,9.3,;6.16,10.84,;4.72,11.39,;3.53,10.41,;2.04,10.8,;1.21,9.5,;-.31,9.25,;-.85,7.81,;.12,6.62,;1.64,6.87,;2.19,8.31,;3.62,8.87,;-.35,5.15,;.55,3.91,;-.35,2.66,;.42,1.33,;-.41,.03,;.29,-1.34,;1.83,-1.41,;2.66,-.11,;1.96,1.26,;2.6,-2.74,;1.94,-4.13,;2.81,-5.4,;4.35,-5.28,;5.01,-3.89,;4.14,-2.62,;5.22,-6.55,;6.75,-6.43,;4.55,-7.94,;4.55,-9.48,;3.05,-7.6,;-1.82,3.14,;-3.15,2.37,;-4.48,3.14,;-4.48,4.68,;-3.15,5.45,;-3.15,6.99,;-1.82,4.68,)|
Show InChI InChI=1S/C33H40N10O2/c1-40(2)33(44)42-16-14-41(15-17-42)23-9-11-24(12-10-23)43-32-29(31(34)35-20-36-32)30(39-43)22-8-13-25-26(18-22)38-28(37-25)19-21-6-4-5-7-27(21)45-3/h4-8,13,18,20,23-24H,9-12,14-17,19H2,1-3H3,(H,37,38)(H2,34,35,36)/t23-,24-
n/an/a 17n/an/an/an/a7.523
Abbott Laboratories
Assay Description
Assays were performed in 96-well microtiter plates in reaction buffer containing biotinylated substrate, ATP, and purified kinase in the presence of ...
Bioorg Med Chem Lett 19: 1718-21 (2009)
Article DOI: 10.1016/j.bmcl.2009.01.086
BindingDB Entry DOI: 10.7270/Q2CJ8BTG
EGF-R Tyrosine Kinase Mutant (L858R)
(Homo sapiens (Human))
BDBM27968
(4-[4-(4-amino-3-{2-[(2-methoxyphenyl)methyl]-1H-1,...)
Show SMILES COc1ccccc1Cc1nc2ccc(cc2[nH]1)-c1nn([C@H]2CC[C@@H](CC2)N2CCN(CC2)C(=O)N(C)C)c2ncnc(N)c12 |r,wU:24.30,wD:21.23,(8.83,13.92,;7.49,13.15,;7.49,11.61,;8.83,10.84,;8.83,9.3,;7.49,8.53,;6.16,9.3,;6.16,10.84,;4.72,11.39,;3.53,10.41,;2.04,10.8,;1.21,9.5,;-.31,9.25,;-.85,7.81,;.12,6.62,;1.64,6.87,;2.19,8.31,;3.62,8.87,;-.35,5.15,;.55,3.91,;-.35,2.66,;.42,1.33,;-.41,.03,;.29,-1.34,;1.83,-1.41,;2.66,-.11,;1.96,1.26,;2.6,-2.74,;1.94,-4.13,;2.81,-5.4,;4.35,-5.28,;5.01,-3.89,;4.14,-2.62,;5.22,-6.55,;6.75,-6.43,;4.55,-7.94,;4.55,-9.48,;3.05,-7.6,;-1.82,3.14,;-3.15,2.37,;-4.48,3.14,;-4.48,4.68,;-3.15,5.45,;-3.15,6.99,;-1.82,4.68,)|
Show InChI InChI=1S/C33H40N10O2/c1-40(2)33(44)42-16-14-41(15-17-42)23-9-11-24(12-10-23)43-32-29(31(34)35-20-36-32)30(39-43)22-8-13-25-26(18-22)38-28(37-25)19-21-6-4-5-7-27(21)45-3/h4-8,13,18,20,23-24H,9-12,14-17,19H2,1-3H3,(H,37,38)(H2,34,35,36)/t23-,24-
n/an/a 25n/an/an/an/a7.523
Abbott Laboratories
Assay Description
Assays were performed in 96-well microtiter plates in reaction buffer containing biotinylated substrate, ATP, and purified kinase in the presence of ...
Bioorg Med Chem Lett 19: 1718-21 (2009)
Article DOI: 10.1016/j.bmcl.2009.01.086
BindingDB Entry DOI: 10.7270/Q2CJ8BTG