BDBM27992 2-[methyl(2-phenylethyl)amino]-N-(2-phenoxyethyl)-4-(3,4,5-trimethoxyphenyl)pyrimidine-5-carboxamide::trisubstituted pyrimidine analogue, 6m
SMILES: COc1cc(cc(OC)c1OC)-c1nc(ncc1C(=O)NCCOc1ccccc1)N(C)CCc1ccccc1
InChI Key: InChIKey=RVTLUNLEWYUCJZ-UHFFFAOYSA-N
Data: 1 IC50
Activity Spreadsheet -- Enzyme Inhibition Constant Data from BindingDB
Found 1 hit for monomerid = 27992
Trg + Lig
Ki
nM
ΔG°
kcal/mole
IC50
nM
Kd
nM
EC50/IC50
nM
koff
s-1
kon
M-1s-1
pHTemp
°C
Calcium-sensing receptor (CaSR)
(Homo sapiens (Human))
BDBM27992
(2-[methyl(2-phenylethyl)amino]-N-(2-phenoxyethyl)-...)
Show SMILES COc1cc(cc(OC)c1OC)-c1nc(ncc1C(=O)NCCOc1ccccc1)N(C)CCc1ccccc1
Show InChI InChI=1S/C31H34N4O5/c1-35(17-15-22-11-7-5-8-12-22)31-33-21-25(30(36)32-16-18-40-24-13-9-6-10-14-24)28(34-31)23-19-26(37-2)29(39-4)27(20-23)38-3/h5-14,19-21H,15-18H2,1-4H3,(H,32,36)
n/an/a 1.50E+3n/an/an/an/a7.537
Bristol-Myers Squibb Company
Assay Description
Antagonist activity of test compounds was measured in HEK293 cells stably expressing the human recombinant CaR (HEK-CaR) by determining the ability o...
J Med Chem 52: 1204-8 (2009)
Article DOI: 10.1021/jm801178c
BindingDB Entry DOI: 10.7270/Q2416VCR