BDBM279970 US10028961, Compound 123::US10172864, Compound 123::US10946023, Compound 123
SMILES: Fc1cc(F)cc(Nc2nc(NC3CCC(F)(F)C3)nc(n2)-c2cccc(n2)C(F)(F)F)c1
InChI Key: InChIKey=DTFRDAWQNHNMEU-UHFFFAOYSA-N
Data: 12 IC50
Activity Spreadsheet -- Enzyme Inhibition Constant Data from BindingDB
Found 12 hits for monomerid = 279970
Trg + Lig
Ki
nM
ΔG°
kcal/mole
IC50
nM
Kd
nM
EC50/IC50
nM
koff
s-1
kon
M-1s-1
pHTemp
°C
IDH1 R132H
(Homo sapiens (Human))
BDBM279970
(US10028961, Compound 123 | US10172864, Compound 12...)
Show SMILES Fc1cc(F)cc(Nc2nc(NC3CCC(F)(F)C3)nc(n2)-c2cccc(n2)C(F)(F)F)c1
Show InChI InChI=1S/C20H15F7N6/c21-10-6-11(22)8-13(7-10)29-18-32-16(14-2-1-3-15(30-14)20(25,26)27)31-17(33-18)28-12-4-5-19(23,24)9-12/h1-3,6-8,12H,4-5,9H2,(H2,28,29,31,32,33)
US Patent
n/an/a<50n/an/an/an/a6.525
Agios Pharmaceuticals, Inc.
US Patent
Assay Description
In the primary reaction, the reduction of α-KG acid to 2-HG is accompanied by a concomitant oxidation of NADPH to NADP. The amount of NADPH rema...
US Patent US10028961 (2018)
BindingDB Entry DOI: 10.7270/Q2ZW1NXM
IDH1 R132C
(Homo sapiens (Human))
BDBM279970
(US10028961, Compound 123 | US10172864, Compound 12...)
Show SMILES Fc1cc(F)cc(Nc2nc(NC3CCC(F)(F)C3)nc(n2)-c2cccc(n2)C(F)(F)F)c1
Show InChI InChI=1S/C20H15F7N6/c21-10-6-11(22)8-13(7-10)29-18-32-16(14-2-1-3-15(30-14)20(25,26)27)31-17(33-18)28-12-4-5-19(23,24)9-12/h1-3,6-8,12H,4-5,9H2,(H2,28,29,31,32,33)
US Patent
n/an/a<50n/an/an/an/a6.525
Agios Pharmaceuticals, Inc.
US Patent
Assay Description
In the primary reaction, the reduction of α-KG acid to 2-HG is accompanied by a concomitant oxidation of NADPH to NADP. The amount of NADPH rema...
US Patent US10028961 (2018)
BindingDB Entry DOI: 10.7270/Q2ZW1NXM
IDH2(R140Q)
(Homo sapiens (Human))
BDBM279970
(US10028961, Compound 123 | US10172864, Compound 12...)
Show SMILES Fc1cc(F)cc(Nc2nc(NC3CCC(F)(F)C3)nc(n2)-c2cccc(n2)C(F)(F)F)c1
Show InChI InChI=1S/C20H15F7N6/c21-10-6-11(22)8-13(7-10)29-18-32-16(14-2-1-3-15(30-14)20(25,26)27)31-17(33-18)28-12-4-5-19(23,24)9-12/h1-3,6-8,12H,4-5,9H2,(H2,28,29,31,32,33)
US Patent
n/an/a<50n/an/an/an/a7.525
Agios Pharmaceuticals, Inc.
US Patent
Assay Description
Compounds are assayed for IDH2 R140Q inhibitory activity through a cofactor depletion assay. Compounds are preincubated with enzyme, then the reactio...
US Patent US10028961 (2018)
BindingDB Entry DOI: 10.7270/Q2ZW1NXM
IDH1 R132H
(Homo sapiens (Human))
BDBM279970
(US10028961, Compound 123 | US10172864, Compound 12...)
Show SMILES Fc1cc(F)cc(Nc2nc(NC3CCC(F)(F)C3)nc(n2)-c2cccc(n2)C(F)(F)F)c1
Show InChI InChI=1S/C20H15F7N6/c21-10-6-11(22)8-13(7-10)29-18-32-16(14-2-1-3-15(30-14)20(25,26)27)31-17(33-18)28-12-4-5-19(23,24)9-12/h1-3,6-8,12H,4-5,9H2,(H2,28,29,31,32,33)
US Patent
n/an/a<50n/an/an/an/a7.525
Agios Pharmaceuticals, Inc.
US Patent
Assay Description
A test compound is prepared as 10 mM stock in DMSO and diluted to 50× final concentration in DMSO, for a 50 μl reaction mixture. IDH enzyme acti...
US Patent US10028961 (2018)
BindingDB Entry DOI: 10.7270/Q2ZW1NXM
IDH1 R132H
(Homo sapiens (Human))
BDBM279970
(US10028961, Compound 123 | US10172864, Compound 12...)
Show SMILES Fc1cc(F)cc(Nc2nc(NC3CCC(F)(F)C3)nc(n2)-c2cccc(n2)C(F)(F)F)c1
Show InChI InChI=1S/C20H15F7N6/c21-10-6-11(22)8-13(7-10)29-18-32-16(14-2-1-3-15(30-14)20(25,26)27)31-17(33-18)28-12-4-5-19(23,24)9-12/h1-3,6-8,12H,4-5,9H2,(H2,28,29,31,32,33)
US Patent
n/an/a<50n/an/an/an/an/an/a
Agios Pharmaceuticals, Inc.
US Patent
Assay Description
In the primary reaction, the reduction of α-KG acid to 2-HG is accompanied by a concomitant oxidation of NADPH to NADP. The amount of NADPH rema...
US Patent US10172864 (2019)
BindingDB Entry DOI: 10.7270/Q2ZK5JQ3
IDH1 R132H
(Homo sapiens (Human))
BDBM279970
(US10028961, Compound 123 | US10172864, Compound 12...)
Show SMILES Fc1cc(F)cc(Nc2nc(NC3CCC(F)(F)C3)nc(n2)-c2cccc(n2)C(F)(F)F)c1
Show InChI InChI=1S/C20H15F7N6/c21-10-6-11(22)8-13(7-10)29-18-32-16(14-2-1-3-15(30-14)20(25,26)27)31-17(33-18)28-12-4-5-19(23,24)9-12/h1-3,6-8,12H,4-5,9H2,(H2,28,29,31,32,33)
US Patent
n/an/a<50n/an/an/an/an/an/a
Agios Pharmaceuticals, Inc.
US Patent
Assay Description
A test compound is prepared as 10 mM stock in DMSO and diluted to 50× final concentration in DMSO, for a 50 μl reaction mixture. IDH enzyme acti...
US Patent US10946023 (2021)
IDH2(R140Q)
(Homo sapiens (Human))
BDBM279970
(US10028961, Compound 123 | US10172864, Compound 12...)
Show SMILES Fc1cc(F)cc(Nc2nc(NC3CCC(F)(F)C3)nc(n2)-c2cccc(n2)C(F)(F)F)c1
Show InChI InChI=1S/C20H15F7N6/c21-10-6-11(22)8-13(7-10)29-18-32-16(14-2-1-3-15(30-14)20(25,26)27)31-17(33-18)28-12-4-5-19(23,24)9-12/h1-3,6-8,12H,4-5,9H2,(H2,28,29,31,32,33)
US Patent
n/an/a<50n/an/an/an/an/an/a
Agios Pharmaceuticals, Inc.
US Patent
Assay Description
Compounds are assayed for IDH2 R140Q inhibitory activity through a cofactor depletion assay. Compounds are preincubated with enzyme, then the reactio...
US Patent US10172864 (2019)
BindingDB Entry DOI: 10.7270/Q2ZK5JQ3
IDH1 R132H
(Homo sapiens (Human))
BDBM279970
(US10028961, Compound 123 | US10172864, Compound 12...)
Show SMILES Fc1cc(F)cc(Nc2nc(NC3CCC(F)(F)C3)nc(n2)-c2cccc(n2)C(F)(F)F)c1
Show InChI InChI=1S/C20H15F7N6/c21-10-6-11(22)8-13(7-10)29-18-32-16(14-2-1-3-15(30-14)20(25,26)27)31-17(33-18)28-12-4-5-19(23,24)9-12/h1-3,6-8,12H,4-5,9H2,(H2,28,29,31,32,33)
US Patent
n/an/a<50n/an/an/an/an/an/a
Agios Pharmaceuticals, Inc.
US Patent
Assay Description
A test compound is prepared as 10 mM stock in DMSO and diluted to 50× final concentration in DMSO, for a 50 μl reaction mixture. IDH enzyme acti...
US Patent US10172864 (2019)
BindingDB Entry DOI: 10.7270/Q2ZK5JQ3
IDH1 WT/IDH1 R132H
(Homo sapiens (Human))
BDBM279970
(US10028961, Compound 123 | US10172864, Compound 12...)
Show SMILES Fc1cc(F)cc(Nc2nc(NC3CCC(F)(F)C3)nc(n2)-c2cccc(n2)C(F)(F)F)c1
Show InChI InChI=1S/C20H15F7N6/c21-10-6-11(22)8-13(7-10)29-18-32-16(14-2-1-3-15(30-14)20(25,26)27)31-17(33-18)28-12-4-5-19(23,24)9-12/h1-3,6-8,12H,4-5,9H2,(H2,28,29,31,32,33)
US Patent
n/an/a<50n/an/an/an/an/an/a
Agios Pharmaceuticals, Inc.
US Patent
Assay Description
In the primary reaction, the reduction of α-KG acid to 2-HG is accompanied by a concomitant oxidation of NADPH to NADP. The amount of NADPH rema...
US Patent US10946023 (2021)
IDH1 WT/IDH1 R132C
(Homo sapiens (Human))
BDBM279970
(US10028961, Compound 123 | US10172864, Compound 12...)
Show SMILES Fc1cc(F)cc(Nc2nc(NC3CCC(F)(F)C3)nc(n2)-c2cccc(n2)C(F)(F)F)c1
Show InChI InChI=1S/C20H15F7N6/c21-10-6-11(22)8-13(7-10)29-18-32-16(14-2-1-3-15(30-14)20(25,26)27)31-17(33-18)28-12-4-5-19(23,24)9-12/h1-3,6-8,12H,4-5,9H2,(H2,28,29,31,32,33)
US Patent
n/an/a<50n/an/an/an/an/an/a
Agios Pharmaceuticals, Inc.
US Patent
Assay Description
In the primary reaction, the reduction of α-KG acid to 2-HG is accompanied by a concomitant oxidation of NADPH to NADP. The amount of NADPH rema...
US Patent US10946023 (2021)
IDH2(R140Q)
(Homo sapiens (Human))
BDBM279970
(US10028961, Compound 123 | US10172864, Compound 12...)
Show SMILES Fc1cc(F)cc(Nc2nc(NC3CCC(F)(F)C3)nc(n2)-c2cccc(n2)C(F)(F)F)c1
Show InChI InChI=1S/C20H15F7N6/c21-10-6-11(22)8-13(7-10)29-18-32-16(14-2-1-3-15(30-14)20(25,26)27)31-17(33-18)28-12-4-5-19(23,24)9-12/h1-3,6-8,12H,4-5,9H2,(H2,28,29,31,32,33)
US Patent
n/an/a<50n/an/an/an/an/an/a
Agios Pharmaceuticals, Inc.
US Patent
Assay Description
Compounds are assayed for IDH2 R140Q inhibitory activity through a cofactor depletion assay. Compounds are preincubated with enzyme, then the reactio...
US Patent US10946023 (2021)
IDH1 R132H
(Homo sapiens (Human))
BDBM279970
(US10028961, Compound 123 | US10172864, Compound 12...)
Show SMILES Fc1cc(F)cc(Nc2nc(NC3CCC(F)(F)C3)nc(n2)-c2cccc(n2)C(F)(F)F)c1
Show InChI InChI=1S/C20H15F7N6/c21-10-6-11(22)8-13(7-10)29-18-32-16(14-2-1-3-15(30-14)20(25,26)27)31-17(33-18)28-12-4-5-19(23,24)9-12/h1-3,6-8,12H,4-5,9H2,(H2,28,29,31,32,33)
US Patent
n/an/a<50n/an/an/an/an/an/a
Agios Pharmaceuticals, Inc.
US Patent
Assay Description
In the primary reaction, the reduction of α-KG acid to 2-HG is accompanied by a concomitant oxidation of NADPH to NADP. The amount of NADPH rema...
US Patent US10172864 (2019)
BindingDB Entry DOI: 10.7270/Q2ZK5JQ3