BDBM279973 US10028961, Compound 126::US10172864, Compound 126::US10946023, Compound 126
SMILES: FC(F)(F)c1ccn(n1)-c1nc(NC2CC(F)(F)C2)nc(NC2CC(F)(F)C2)n1
InChI Key: InChIKey=NYHCCPXGTKQDAW-UHFFFAOYSA-N
Data: 12 IC50
Activity Spreadsheet -- Enzyme Inhibition Constant Data from BindingDB
Found 12 hits for monomerid = 279973
Trg + Lig
Ki
nM
ΔG°
kcal/mole
IC50
nM
Kd
nM
EC50/IC50
nM
koff
s-1
kon
M-1s-1
pHTemp
°C
Cytosolic NADP-isocitrate dehydrogenase (IDH1)(R132H)
(Homo sapiens (Human))
BDBM279973
(US10028961, Compound 126 | US10172864, Compound 12...)
Show SMILES FC(F)(F)c1ccn(n1)-c1nc(NC2CC(F)(F)C2)nc(NC2CC(F)(F)C2)n1
Show InChI InChI=1S/C15H14F7N7/c16-13(17)3-7(4-13)23-10-25-11(24-8-5-14(18,19)6-8)27-12(26-10)29-2-1-9(28-29)15(20,21)22/h1-2,7-8H,3-6H2,(H2,23,24,25,26,27)
US Patent
n/an/a<50n/an/an/an/a6.525
Agios Pharmaceuticals, Inc.
US Patent
Assay Description
In the primary reaction, the reduction of α-KG acid to 2-HG is accompanied by a concomitant oxidation of NADPH to NADP. The amount of NADPH rema...
US Patent US10028961 (2018)
BindingDB Entry DOI: 10.7270/Q2ZW1NXM
IDH1 R132C
(Homo sapiens (Human))
BDBM279973
(US10028961, Compound 126 | US10172864, Compound 12...)
Show SMILES FC(F)(F)c1ccn(n1)-c1nc(NC2CC(F)(F)C2)nc(NC2CC(F)(F)C2)n1
Show InChI InChI=1S/C15H14F7N7/c16-13(17)3-7(4-13)23-10-25-11(24-8-5-14(18,19)6-8)27-12(26-10)29-2-1-9(28-29)15(20,21)22/h1-2,7-8H,3-6H2,(H2,23,24,25,26,27)
US Patent
n/an/a<50n/an/an/an/a6.525
Agios Pharmaceuticals, Inc.
US Patent
Assay Description
In the primary reaction, the reduction of α-KG acid to 2-HG is accompanied by a concomitant oxidation of NADPH to NADP. The amount of NADPH rema...
US Patent US10028961 (2018)
BindingDB Entry DOI: 10.7270/Q2ZW1NXM
IDH2(R140Q)
(Homo sapiens (Human))
BDBM279973
(US10028961, Compound 126 | US10172864, Compound 12...)
Show SMILES FC(F)(F)c1ccn(n1)-c1nc(NC2CC(F)(F)C2)nc(NC2CC(F)(F)C2)n1
Show InChI InChI=1S/C15H14F7N7/c16-13(17)3-7(4-13)23-10-25-11(24-8-5-14(18,19)6-8)27-12(26-10)29-2-1-9(28-29)15(20,21)22/h1-2,7-8H,3-6H2,(H2,23,24,25,26,27)
US Patent
n/an/a<50n/an/an/an/a7.525
Agios Pharmaceuticals, Inc.
US Patent
Assay Description
Compounds are assayed for IDH2 R140Q inhibitory activity through a cofactor depletion assay. Compounds are preincubated with enzyme, then the reactio...
US Patent US10028961 (2018)
BindingDB Entry DOI: 10.7270/Q2ZW1NXM
Cytosolic NADP-isocitrate dehydrogenase (IDH1)(R132H)
(Homo sapiens (Human))
BDBM279973
(US10028961, Compound 126 | US10172864, Compound 12...)
Show SMILES FC(F)(F)c1ccn(n1)-c1nc(NC2CC(F)(F)C2)nc(NC2CC(F)(F)C2)n1
Show InChI InChI=1S/C15H14F7N7/c16-13(17)3-7(4-13)23-10-25-11(24-8-5-14(18,19)6-8)27-12(26-10)29-2-1-9(28-29)15(20,21)22/h1-2,7-8H,3-6H2,(H2,23,24,25,26,27)
US Patent
n/an/a 75n/an/an/an/a7.525
Agios Pharmaceuticals, Inc.
US Patent
Assay Description
A test compound is prepared as 10 mM stock in DMSO and diluted to 50× final concentration in DMSO, for a 50 μl reaction mixture. IDH enzyme acti...
US Patent US10028961 (2018)
BindingDB Entry DOI: 10.7270/Q2ZW1NXM
Cytosolic NADP-isocitrate dehydrogenase (IDH1)(R132H)
(Homo sapiens (Human))
BDBM279973
(US10028961, Compound 126 | US10172864, Compound 12...)
Show SMILES FC(F)(F)c1ccn(n1)-c1nc(NC2CC(F)(F)C2)nc(NC2CC(F)(F)C2)n1
Show InChI InChI=1S/C15H14F7N7/c16-13(17)3-7(4-13)23-10-25-11(24-8-5-14(18,19)6-8)27-12(26-10)29-2-1-9(28-29)15(20,21)22/h1-2,7-8H,3-6H2,(H2,23,24,25,26,27)
US Patent
n/an/a<50n/an/an/an/an/an/a
Agios Pharmaceuticals, Inc.
US Patent
Assay Description
In the primary reaction, the reduction of α-KG acid to 2-HG is accompanied by a concomitant oxidation of NADPH to NADP. The amount of NADPH rema...
US Patent US10172864 (2019)
BindingDB Entry DOI: 10.7270/Q2ZK5JQ3
IDH2(R140Q)
(Homo sapiens (Human))
BDBM279973
(US10028961, Compound 126 | US10172864, Compound 12...)
Show SMILES FC(F)(F)c1ccn(n1)-c1nc(NC2CC(F)(F)C2)nc(NC2CC(F)(F)C2)n1
Show InChI InChI=1S/C15H14F7N7/c16-13(17)3-7(4-13)23-10-25-11(24-8-5-14(18,19)6-8)27-12(26-10)29-2-1-9(28-29)15(20,21)22/h1-2,7-8H,3-6H2,(H2,23,24,25,26,27)
US Patent
n/an/a<50n/an/an/an/an/an/a
Agios Pharmaceuticals, Inc.
US Patent
Assay Description
Compounds are assayed for IDH2 R140Q inhibitory activity through a cofactor depletion assay. Compounds are preincubated with enzyme, then the reactio...
US Patent US10946023 (2021)
IDH2(R140Q)
(Homo sapiens (Human))
BDBM279973
(US10028961, Compound 126 | US10172864, Compound 12...)
Show SMILES FC(F)(F)c1ccn(n1)-c1nc(NC2CC(F)(F)C2)nc(NC2CC(F)(F)C2)n1
Show InChI InChI=1S/C15H14F7N7/c16-13(17)3-7(4-13)23-10-25-11(24-8-5-14(18,19)6-8)27-12(26-10)29-2-1-9(28-29)15(20,21)22/h1-2,7-8H,3-6H2,(H2,23,24,25,26,27)
US Patent
n/an/a<50n/an/an/an/an/an/a
Agios Pharmaceuticals, Inc.
US Patent
Assay Description
Compounds are assayed for IDH2 R140Q inhibitory activity through a cofactor depletion assay. Compounds are preincubated with enzyme, then the reactio...
US Patent US10172864 (2019)
BindingDB Entry DOI: 10.7270/Q2ZK5JQ3
Cytosolic NADP-isocitrate dehydrogenase (IDH1)(R132H)
(Homo sapiens (Human))
BDBM279973
(US10028961, Compound 126 | US10172864, Compound 12...)
Show SMILES FC(F)(F)c1ccn(n1)-c1nc(NC2CC(F)(F)C2)nc(NC2CC(F)(F)C2)n1
Show InChI InChI=1S/C15H14F7N7/c16-13(17)3-7(4-13)23-10-25-11(24-8-5-14(18,19)6-8)27-12(26-10)29-2-1-9(28-29)15(20,21)22/h1-2,7-8H,3-6H2,(H2,23,24,25,26,27)
US Patent
n/an/a 75n/an/an/an/an/an/a
Agios Pharmaceuticals, Inc.
US Patent
Assay Description
A test compound is prepared as 10 mM stock in DMSO and diluted to 50× final concentration in DMSO, for a 50 μl reaction mixture. IDH enzyme acti...
US Patent US10172864 (2019)
BindingDB Entry DOI: 10.7270/Q2ZK5JQ3
Cytosolic NADP-isocitrate dehydrogenase (IDH1)(R132H)
(Homo sapiens (Human))
BDBM279973
(US10028961, Compound 126 | US10172864, Compound 12...)
Show SMILES FC(F)(F)c1ccn(n1)-c1nc(NC2CC(F)(F)C2)nc(NC2CC(F)(F)C2)n1
Show InChI InChI=1S/C15H14F7N7/c16-13(17)3-7(4-13)23-10-25-11(24-8-5-14(18,19)6-8)27-12(26-10)29-2-1-9(28-29)15(20,21)22/h1-2,7-8H,3-6H2,(H2,23,24,25,26,27)
US Patent
n/an/a 75n/an/an/an/an/an/a
Agios Pharmaceuticals, Inc.
US Patent
Assay Description
A test compound is prepared as 10 mM stock in DMSO and diluted to 50× final concentration in DMSO, for a 50 μl reaction mixture. IDH enzyme acti...
US Patent US10946023 (2021)
IDH1 WT/IDH1 R132H
(Homo sapiens (Human))
BDBM279973
(US10028961, Compound 126 | US10172864, Compound 12...)
Show SMILES FC(F)(F)c1ccn(n1)-c1nc(NC2CC(F)(F)C2)nc(NC2CC(F)(F)C2)n1
Show InChI InChI=1S/C15H14F7N7/c16-13(17)3-7(4-13)23-10-25-11(24-8-5-14(18,19)6-8)27-12(26-10)29-2-1-9(28-29)15(20,21)22/h1-2,7-8H,3-6H2,(H2,23,24,25,26,27)
US Patent
n/an/a<50n/an/an/an/an/an/a
Agios Pharmaceuticals, Inc.
US Patent
Assay Description
In the primary reaction, the reduction of α-KG acid to 2-HG is accompanied by a concomitant oxidation of NADPH to NADP. The amount of NADPH rema...
US Patent US10946023 (2021)
IDH1 WT/IDH1 R132C
(Homo sapiens (Human))
BDBM279973
(US10028961, Compound 126 | US10172864, Compound 12...)
Show SMILES FC(F)(F)c1ccn(n1)-c1nc(NC2CC(F)(F)C2)nc(NC2CC(F)(F)C2)n1
Show InChI InChI=1S/C15H14F7N7/c16-13(17)3-7(4-13)23-10-25-11(24-8-5-14(18,19)6-8)27-12(26-10)29-2-1-9(28-29)15(20,21)22/h1-2,7-8H,3-6H2,(H2,23,24,25,26,27)
US Patent
n/an/a<50n/an/an/an/an/an/a
Agios Pharmaceuticals, Inc.
US Patent
Assay Description
In the primary reaction, the reduction of α-KG acid to 2-HG is accompanied by a concomitant oxidation of NADPH to NADP. The amount of NADPH rema...
US Patent US10946023 (2021)
Cytosolic NADP-isocitrate dehydrogenase (IDH1)(R132H)
(Homo sapiens (Human))
BDBM279973
(US10028961, Compound 126 | US10172864, Compound 12...)
Show SMILES FC(F)(F)c1ccn(n1)-c1nc(NC2CC(F)(F)C2)nc(NC2CC(F)(F)C2)n1
Show InChI InChI=1S/C15H14F7N7/c16-13(17)3-7(4-13)23-10-25-11(24-8-5-14(18,19)6-8)27-12(26-10)29-2-1-9(28-29)15(20,21)22/h1-2,7-8H,3-6H2,(H2,23,24,25,26,27)
US Patent
n/an/a<50n/an/an/an/an/an/a
Agios Pharmaceuticals, Inc.
US Patent
Assay Description
In the primary reaction, the reduction of α-KG acid to 2-HG is accompanied by a concomitant oxidation of NADPH to NADP. The amount of NADPH rema...
US Patent US10172864 (2019)
BindingDB Entry DOI: 10.7270/Q2ZK5JQ3