BDBM28005 2-[benzyl(methyl)amino]-4-(2-methoxyphenyl)-N-(2-phenoxyethyl)pyrimidine-5-carboxamide::trisubstituted pyrimidine analogue, 11f
SMILES: COc1ccccc1-c1nc(ncc1C(=O)NCCOc1ccccc1)N(C)Cc1ccccc1
InChI Key: InChIKey=VZPCWEUKTNVVIE-UHFFFAOYSA-N
Data: 1 IC50
Activity Spreadsheet -- Enzyme Inhibition Constant Data from BindingDB
Found 1 hit for monomerid = 28005
Trg + Lig
Ki
nM
ΔG°
kcal/mole
IC50
nM
Kd
nM
EC50/IC50
nM
koff
s-1
kon
M-1s-1
pHTemp
°C
Calcium-sensing receptor (CaSR)
(Homo sapiens (Human))
BDBM28005
(2-[benzyl(methyl)amino]-4-(2-methoxyphenyl)-N-(2-p...)
Show SMILES COc1ccccc1-c1nc(ncc1C(=O)NCCOc1ccccc1)N(C)Cc1ccccc1
Show InChI InChI=1S/C28H28N4O3/c1-32(20-21-11-5-3-6-12-21)28-30-19-24(26(31-28)23-15-9-10-16-25(23)34-2)27(33)29-17-18-35-22-13-7-4-8-14-22/h3-16,19H,17-18,20H2,1-2H3,(H,29,33)
n/an/a>3.00E+4n/an/an/an/a7.537
Bristol-Myers Squibb Company
Assay Description
Antagonist activity of test compounds was measured in HEK293 cells stably expressing the human recombinant CaR (HEK-CaR) by determining the ability o...
J Med Chem 52: 1204-8 (2009)
Article DOI: 10.1021/jm801178c
BindingDB Entry DOI: 10.7270/Q2416VCR