BDBM280405 US10030012, Example 35::ethyl 4-[4-(2- methoxypyridin- 3-yl)piperidin- 1-yl]azepane-1- carboxylate
SMILES: CCOC(=O)N1CCCC(CC1)N1CCC(CC1)c1cccnc1OC
InChI Key: InChIKey=IDDOIYOURRKCMR-UHFFFAOYSA-N
Data: 1 EC50
Activity Spreadsheet -- Enzyme Inhibition Constant Data from BindingDB
Found 1 hit for monomerid = 280405
Trg + Lig
Ki
nM
ΔG°
kcal/mole
IC50
nM
Kd
nM
EC50/IC50
nM
koff
s-1
kon
M-1s-1
pHTemp
°C
Muscarinic acetylcholine receptor M4
(Homo sapiens (Human))
BDBM280405
(US10030012, Example 35 | ethyl 4-[4-(2- methoxypyr...)
Show SMILES CCOC(=O)N1CCCC(CC1)N1CCC(CC1)c1cccnc1OC
Show InChI InChI=1S/C20H31N3O3/c1-3-26-20(24)23-12-5-6-17(10-15-23)22-13-8-16(9-14-22)18-7-4-11-21-19(18)25-2/h4,7,11,16-17H,3,5-6,8-10,12-15H2,1-2H3
Reactome pathway
US Patent
n/an/an/an/a 30n/an/an/an/a
Heptares Therapeutics Limited
US Patent
Assay Description
The functional activity of compounds at the M4 and M2 receptors was determined by measuring changes in the level of intracellular calcium ions caused...
US Patent US10030012 (2018)
BindingDB Entry DOI: 10.7270/Q2KK9DTW