null
SMILES: FC(F)(F)C(OC(=O)N1CCC2(CCN(Cc3ccc(cc3N3CCCC3)C(F)(F)F)C2)CC1)C(F)(F)F
InChI Key: InChIKey=OUFLOGDDQWTDIC-UHFFFAOYSA-N
Activity Spreadsheet -- Enzyme Inhibition Constant Data from BindingDB
Found 7 hits for monomerid = 280527
Trg + Lig
Ki
nM
ΔG°
kcal/mole
IC50
nM
Kd
nM
EC50/IC50
nM
koff
s-1
kon
M-1s-1
pHTemp
°C
Monoglyceride lipase
(Mus musculus (mouse))
BDBM280527
(US10030020, Example 72 | US10781211, Example 201)
Show SMILES FC(F)(F)C(OC(=O)N1CCC2(CCN(Cc3ccc(cc3N3CCCC3)C(F)(F)F)C2)CC1)C(F)(F)F
Show InChI InChI=1S/C24H28F9N3O2/c25-22(26,27)17-4-3-16(18(13-17)35-8-1-2-9-35)14-34-10-5-21(15-34)6-11-36(12-7-21)20(37)38-19(23(28,29)30)24(31,32)33/h3-4,13,19H,1-2,5-12,14-15H2
Reactome pathway
US Patent
n/an/a<100n/an/an/an/an/an/a
ABIDE THERAPEUTICS, INC.
US Patent
Assay Description
Proteomes (mouse brain membrane fraction or cell lysates) (50 μL, 1.0 mg/mL total protein concentration) were preincubated with varying concentr...
US Patent US10030020 (2018)
BindingDB Entry DOI: 10.7270/Q2FX7CGF
Fatty-acid amide hydrolase 1
(Mus musculus (mouse))
BDBM280527
(US10030020, Example 72 | US10781211, Example 201)
Show SMILES FC(F)(F)C(OC(=O)N1CCC2(CCN(Cc3ccc(cc3N3CCCC3)C(F)(F)F)C2)CC1)C(F)(F)F
Show InChI InChI=1S/C24H28F9N3O2/c25-22(26,27)17-4-3-16(18(13-17)35-8-1-2-9-35)14-34-10-5-21(15-34)6-11-36(12-7-21)20(37)38-19(23(28,29)30)24(31,32)33/h3-4,13,19H,1-2,5-12,14-15H2
US Patent
n/an/a>1.00E+3n/an/an/an/an/an/a
ABIDE THERAPEUTICS, INC.
US Patent
Assay Description
Proteomes (mouse brain membrane fraction or cell lysates) (50 μL, 1.0 mg/mL total protein concentration) were preincubated with varying concentr...
US Patent US10030020 (2018)
BindingDB Entry DOI: 10.7270/Q2FX7CGF
Monoacylglycerol lipase ABHD2
(Mus musculus (Mouse))
BDBM280527
(US10030020, Example 72 | US10781211, Example 201)
Show SMILES FC(F)(F)C(OC(=O)N1CCC2(CCN(Cc3ccc(cc3N3CCCC3)C(F)(F)F)C2)CC1)C(F)(F)F
Show InChI InChI=1S/C24H28F9N3O2/c25-22(26,27)17-4-3-16(18(13-17)35-8-1-2-9-35)14-34-10-5-21(15-34)6-11-36(12-7-21)20(37)38-19(23(28,29)30)24(31,32)33/h3-4,13,19H,1-2,5-12,14-15H2
US Patent
n/an/a>1.00E+3n/an/an/an/an/an/a
ABIDE THERAPEUTICS, INC.
US Patent
Assay Description
Proteomes (mouse brain membrane fraction or cell lysates) (50 μL, 1.0 mg/mL total protein concentration) were preincubated with varying concentr...
US Patent US10030020 (2018)
BindingDB Entry DOI: 10.7270/Q2FX7CGF
Monoglyceride lipase
(Homo sapiens (Human))
BDBM280527
(US10030020, Example 72 | US10781211, Example 201)
Show SMILES FC(F)(F)C(OC(=O)N1CCC2(CCN(Cc3ccc(cc3N3CCCC3)C(F)(F)F)C2)CC1)C(F)(F)F
Show InChI InChI=1S/C24H28F9N3O2/c25-22(26,27)17-4-3-16(18(13-17)35-8-1-2-9-35)14-34-10-5-21(15-34)6-11-36(12-7-21)20(37)38-19(23(28,29)30)24(31,32)33/h3-4,13,19H,1-2,5-12,14-15H2
Reactome pathway
US Patent
n/an/a<100n/an/an/an/an/an/a
LUNDBECK LA JOLLA RESEARCH CENTER, INC.
US Patent
Assay Description
Human: Proteomes (human prefrontal cortex or cell membrane fractions) (50 μL, 1.0-2.0 mg/mL total protein concentration) were preincubated with ...
US Patent US10781211 (2020)
BindingDB Entry DOI: 10.7270/Q2RX9G56
Fatty-acid amide hydrolase 1
(Mus musculus (mouse))
BDBM280527
(US10030020, Example 72 | US10781211, Example 201)
Show SMILES FC(F)(F)C(OC(=O)N1CCC2(CCN(Cc3ccc(cc3N3CCCC3)C(F)(F)F)C2)CC1)C(F)(F)F
Show InChI InChI=1S/C24H28F9N3O2/c25-22(26,27)17-4-3-16(18(13-17)35-8-1-2-9-35)14-34-10-5-21(15-34)6-11-36(12-7-21)20(37)38-19(23(28,29)30)24(31,32)33/h3-4,13,19H,1-2,5-12,14-15H2
US Patent
n/an/a>1.00E+3n/an/an/an/an/an/a
LUNDBECK LA JOLLA RESEARCH CENTER, INC.
US Patent
Assay Description
MAGL, ABHD6 and FAAH: Proteomes (mouse brain membrane fraction or cell lysates) (50 μL, 1.0 mg/mL total protein concentration) were preincubated...
US Patent US10781211 (2020)
BindingDB Entry DOI: 10.7270/Q2RX9G56
Monoacylglycerol lipase ABHD6
(Mus musculus (mouse))
BDBM280527
(US10030020, Example 72 | US10781211, Example 201)
Show SMILES FC(F)(F)C(OC(=O)N1CCC2(CCN(Cc3ccc(cc3N3CCCC3)C(F)(F)F)C2)CC1)C(F)(F)F
Show InChI InChI=1S/C24H28F9N3O2/c25-22(26,27)17-4-3-16(18(13-17)35-8-1-2-9-35)14-34-10-5-21(15-34)6-11-36(12-7-21)20(37)38-19(23(28,29)30)24(31,32)33/h3-4,13,19H,1-2,5-12,14-15H2
US Patent
n/an/a>1.00E+3n/an/an/an/an/an/a
LUNDBECK LA JOLLA RESEARCH CENTER, INC.
US Patent
Assay Description
MAGL, ABHD6 and FAAH: Proteomes (mouse brain membrane fraction or cell lysates) (50 μL, 1.0 mg/mL total protein concentration) were preincubated...
US Patent US10781211 (2020)
BindingDB Entry DOI: 10.7270/Q2RX9G56
Monoglyceride lipase
(Mus musculus (mouse))
BDBM280527
(US10030020, Example 72 | US10781211, Example 201)
Show SMILES FC(F)(F)C(OC(=O)N1CCC2(CCN(Cc3ccc(cc3N3CCCC3)C(F)(F)F)C2)CC1)C(F)(F)F
Show InChI InChI=1S/C24H28F9N3O2/c25-22(26,27)17-4-3-16(18(13-17)35-8-1-2-9-35)14-34-10-5-21(15-34)6-11-36(12-7-21)20(37)38-19(23(28,29)30)24(31,32)33/h3-4,13,19H,1-2,5-12,14-15H2
Reactome pathway
US Patent
n/an/a<100n/an/an/an/an/an/a
LUNDBECK LA JOLLA RESEARCH CENTER, INC.
US Patent
Assay Description
MAGL, ABHD6 and FAAH: Proteomes (mouse brain membrane fraction or cell lysates) (50 μL, 1.0 mg/mL total protein concentration) were preincubated...
US Patent US10781211 (2020)
BindingDB Entry DOI: 10.7270/Q2RX9G56