null
SMILES: FC(F)(F)C(OC(=O)N1CCC2(CCCN2Cc2cccc(N3C4CCC3COC4)c2Cl)CC1)C(F)(F)F
InChI Key: InChIKey=BLCOJQQWSPPTIE-UHFFFAOYSA-N
Activity Spreadsheet -- Enzyme Inhibition Constant Data from BindingDB
Found 6 hits for monomerid = 280564
Trg + Lig
Ki
nM
ΔG°
kcal/mole
IC50
nM
Kd
nM
EC50/IC50
nM
koff
s-1
kon
M-1s-1
pHTemp
°C
Monoglyceride lipase
(Mus musculus (mouse))
BDBM280564
(US10030020, Example 109 | US10781211, Example 109)
Show SMILES FC(F)(F)C(OC(=O)N1CCC2(CCCN2Cc2cccc(N3C4CCC3COC4)c2Cl)CC1)C(F)(F)F
Show InChI InChI=1S/C25H30ClF6N3O3/c26-20-16(3-1-4-19(20)35-17-5-6-18(35)15-37-14-17)13-34-10-2-7-23(34)8-11-33(12-9-23)22(36)38-21(24(27,28)29)25(30,31)32/h1,3-4,17-18,21H,2,5-15H2
Reactome pathway
US Patent
n/an/a<100n/an/an/an/an/an/a
ABIDE THERAPEUTICS, INC.
US Patent
Assay Description
Proteomes (mouse brain membrane fraction or cell lysates) (50 μL, 1.0 mg/mL total protein concentration) were preincubated with varying concentr...
US Patent US10030020 (2018)
BindingDB Entry DOI: 10.7270/Q2FX7CGF
Fatty-acid amide hydrolase 1
(Mus musculus (mouse))
BDBM280564
(US10030020, Example 109 | US10781211, Example 109)
Show SMILES FC(F)(F)C(OC(=O)N1CCC2(CCCN2Cc2cccc(N3C4CCC3COC4)c2Cl)CC1)C(F)(F)F
Show InChI InChI=1S/C25H30ClF6N3O3/c26-20-16(3-1-4-19(20)35-17-5-6-18(35)15-37-14-17)13-34-10-2-7-23(34)8-11-33(12-9-23)22(36)38-21(24(27,28)29)25(30,31)32/h1,3-4,17-18,21H,2,5-15H2
US Patent
n/an/a>1.00E+3n/an/an/an/an/an/a
ABIDE THERAPEUTICS, INC.
US Patent
Assay Description
Proteomes (mouse brain membrane fraction or cell lysates) (50 μL, 1.0 mg/mL total protein concentration) were preincubated with varying concentr...
US Patent US10030020 (2018)
BindingDB Entry DOI: 10.7270/Q2FX7CGF
Monoacylglycerol lipase ABHD6
(Mus musculus (mouse))
BDBM280564
(US10030020, Example 109 | US10781211, Example 109)
Show SMILES FC(F)(F)C(OC(=O)N1CCC2(CCCN2Cc2cccc(N3C4CCC3COC4)c2Cl)CC1)C(F)(F)F
Show InChI InChI=1S/C25H30ClF6N3O3/c26-20-16(3-1-4-19(20)35-17-5-6-18(35)15-37-14-17)13-34-10-2-7-23(34)8-11-33(12-9-23)22(36)38-21(24(27,28)29)25(30,31)32/h1,3-4,17-18,21H,2,5-15H2
US Patent
n/an/a>1.00E+3n/an/an/an/an/an/a
LUNDBECK LA JOLLA RESEARCH CENTER, INC.
US Patent
Assay Description
MAGL, ABHD6 and FAAH: Proteomes (mouse brain membrane fraction or cell lysates) (50 μL, 1.0 mg/mL total protein concentration) were preincubated...
US Patent US10781211 (2020)
Monoglyceride lipase
(Mus musculus (mouse))
BDBM280564
(US10030020, Example 109 | US10781211, Example 109)
Show SMILES FC(F)(F)C(OC(=O)N1CCC2(CCCN2Cc2cccc(N3C4CCC3COC4)c2Cl)CC1)C(F)(F)F
Show InChI InChI=1S/C25H30ClF6N3O3/c26-20-16(3-1-4-19(20)35-17-5-6-18(35)15-37-14-17)13-34-10-2-7-23(34)8-11-33(12-9-23)22(36)38-21(24(27,28)29)25(30,31)32/h1,3-4,17-18,21H,2,5-15H2
Reactome pathway
US Patent
n/an/a<100n/an/an/an/an/an/a
LUNDBECK LA JOLLA RESEARCH CENTER, INC.
US Patent
Assay Description
MAGL, ABHD6 and FAAH: Proteomes (mouse brain membrane fraction or cell lysates) (50 μL, 1.0 mg/mL total protein concentration) were preincubated...
US Patent US10781211 (2020)
Fatty-acid amide hydrolase 1
(Mus musculus (mouse))
BDBM280564
(US10030020, Example 109 | US10781211, Example 109)
Show SMILES FC(F)(F)C(OC(=O)N1CCC2(CCCN2Cc2cccc(N3C4CCC3COC4)c2Cl)CC1)C(F)(F)F
Show InChI InChI=1S/C25H30ClF6N3O3/c26-20-16(3-1-4-19(20)35-17-5-6-18(35)15-37-14-17)13-34-10-2-7-23(34)8-11-33(12-9-23)22(36)38-21(24(27,28)29)25(30,31)32/h1,3-4,17-18,21H,2,5-15H2
US Patent
n/an/a>1.00E+3n/an/an/an/an/an/a
LUNDBECK LA JOLLA RESEARCH CENTER, INC.
US Patent
Assay Description
MAGL, ABHD6 and FAAH: Proteomes (mouse brain membrane fraction or cell lysates) (50 μL, 1.0 mg/mL total protein concentration) were preincubated...
US Patent US10781211 (2020)
Monoacylglycerol lipase ABHD2
(Mus musculus (Mouse))
BDBM280564
(US10030020, Example 109 | US10781211, Example 109)
Show SMILES FC(F)(F)C(OC(=O)N1CCC2(CCCN2Cc2cccc(N3C4CCC3COC4)c2Cl)CC1)C(F)(F)F
Show InChI InChI=1S/C25H30ClF6N3O3/c26-20-16(3-1-4-19(20)35-17-5-6-18(35)15-37-14-17)13-34-10-2-7-23(34)8-11-33(12-9-23)22(36)38-21(24(27,28)29)25(30,31)32/h1,3-4,17-18,21H,2,5-15H2
US Patent
n/an/a>1.00E+3n/an/an/an/an/an/a
ABIDE THERAPEUTICS, INC.
US Patent
Assay Description
Proteomes (mouse brain membrane fraction or cell lysates) (50 μL, 1.0 mg/mL total protein concentration) were preincubated with varying concentr...
US Patent US10030020 (2018)
BindingDB Entry DOI: 10.7270/Q2FX7CGF