null
SMILES: FC(F)(F)C(OC(=O)N1CCC2(CCCN2Cc2cccc(N3CCC(F)(F)CC3)c2Cl)CC1)C(F)(F)F
InChI Key: InChIKey=NHBDZJPLDOFUCX-UHFFFAOYSA-N
Activity Spreadsheet -- Enzyme Inhibition Constant Data from BindingDB
Found 6 hits for monomerid = 280566
Trg + Lig
Ki
nM
ΔG°
kcal/mole
IC50
nM
Kd
nM
EC50/IC50
nM
koff
s-1
kon
M-1s-1
pHTemp
°C
Monoglyceride lipase
(Mus musculus (mouse))
BDBM280566
(US10030020, Example 111 | US10781211, Example 111)
Show SMILES FC(F)(F)C(OC(=O)N1CCC2(CCCN2Cc2cccc(N3CCC(F)(F)CC3)c2Cl)CC1)C(F)(F)F
Show InChI InChI=1S/C24H28ClF8N3O2/c25-18-16(3-1-4-17(18)34-13-8-22(26,27)9-14-34)15-36-10-2-5-21(36)6-11-35(12-7-21)20(37)38-19(23(28,29)30)24(31,32)33/h1,3-4,19H,2,5-15H2
Reactome pathway
US Patent
n/an/a<100n/an/an/an/an/an/a
ABIDE THERAPEUTICS, INC.
US Patent
Assay Description
Proteomes (mouse brain membrane fraction or cell lysates) (50 μL, 1.0 mg/mL total protein concentration) were preincubated with varying concentr...
US Patent US10030020 (2018)
BindingDB Entry DOI: 10.7270/Q2FX7CGF
Fatty-acid amide hydrolase 1
(Mus musculus (mouse))
BDBM280566
(US10030020, Example 111 | US10781211, Example 111)
Show SMILES FC(F)(F)C(OC(=O)N1CCC2(CCCN2Cc2cccc(N3CCC(F)(F)CC3)c2Cl)CC1)C(F)(F)F
Show InChI InChI=1S/C24H28ClF8N3O2/c25-18-16(3-1-4-17(18)34-13-8-22(26,27)9-14-34)15-36-10-2-5-21(36)6-11-35(12-7-21)20(37)38-19(23(28,29)30)24(31,32)33/h1,3-4,19H,2,5-15H2
US Patent
n/an/a>1.00E+3n/an/an/an/an/an/a
ABIDE THERAPEUTICS, INC.
US Patent
Assay Description
Proteomes (mouse brain membrane fraction or cell lysates) (50 μL, 1.0 mg/mL total protein concentration) were preincubated with varying concentr...
US Patent US10030020 (2018)
BindingDB Entry DOI: 10.7270/Q2FX7CGF
Monoacylglycerol lipase ABHD6
(Mus musculus (mouse))
BDBM280566
(US10030020, Example 111 | US10781211, Example 111)
Show SMILES FC(F)(F)C(OC(=O)N1CCC2(CCCN2Cc2cccc(N3CCC(F)(F)CC3)c2Cl)CC1)C(F)(F)F
Show InChI InChI=1S/C24H28ClF8N3O2/c25-18-16(3-1-4-17(18)34-13-8-22(26,27)9-14-34)15-36-10-2-5-21(36)6-11-35(12-7-21)20(37)38-19(23(28,29)30)24(31,32)33/h1,3-4,19H,2,5-15H2
US Patent
n/an/a>1.00E+3n/an/an/an/an/an/a
LUNDBECK LA JOLLA RESEARCH CENTER, INC.
US Patent
Assay Description
MAGL, ABHD6 and FAAH: Proteomes (mouse brain membrane fraction or cell lysates) (50 μL, 1.0 mg/mL total protein concentration) were preincubated...
US Patent US10781211 (2020)
Monoglyceride lipase
(Mus musculus (mouse))
BDBM280566
(US10030020, Example 111 | US10781211, Example 111)
Show SMILES FC(F)(F)C(OC(=O)N1CCC2(CCCN2Cc2cccc(N3CCC(F)(F)CC3)c2Cl)CC1)C(F)(F)F
Show InChI InChI=1S/C24H28ClF8N3O2/c25-18-16(3-1-4-17(18)34-13-8-22(26,27)9-14-34)15-36-10-2-5-21(36)6-11-35(12-7-21)20(37)38-19(23(28,29)30)24(31,32)33/h1,3-4,19H,2,5-15H2
Reactome pathway
US Patent
n/an/a<100n/an/an/an/an/an/a
LUNDBECK LA JOLLA RESEARCH CENTER, INC.
US Patent
Assay Description
MAGL, ABHD6 and FAAH: Proteomes (mouse brain membrane fraction or cell lysates) (50 μL, 1.0 mg/mL total protein concentration) were preincubated...
US Patent US10781211 (2020)
Fatty-acid amide hydrolase 1
(Mus musculus (mouse))
BDBM280566
(US10030020, Example 111 | US10781211, Example 111)
Show SMILES FC(F)(F)C(OC(=O)N1CCC2(CCCN2Cc2cccc(N3CCC(F)(F)CC3)c2Cl)CC1)C(F)(F)F
Show InChI InChI=1S/C24H28ClF8N3O2/c25-18-16(3-1-4-17(18)34-13-8-22(26,27)9-14-34)15-36-10-2-5-21(36)6-11-35(12-7-21)20(37)38-19(23(28,29)30)24(31,32)33/h1,3-4,19H,2,5-15H2
US Patent
n/an/a>1.00E+3n/an/an/an/an/an/a
LUNDBECK LA JOLLA RESEARCH CENTER, INC.
US Patent
Assay Description
MAGL, ABHD6 and FAAH: Proteomes (mouse brain membrane fraction or cell lysates) (50 μL, 1.0 mg/mL total protein concentration) were preincubated...
US Patent US10781211 (2020)
Monoacylglycerol lipase ABHD2
(Mus musculus (Mouse))
BDBM280566
(US10030020, Example 111 | US10781211, Example 111)
Show SMILES FC(F)(F)C(OC(=O)N1CCC2(CCCN2Cc2cccc(N3CCC(F)(F)CC3)c2Cl)CC1)C(F)(F)F
Show InChI InChI=1S/C24H28ClF8N3O2/c25-18-16(3-1-4-17(18)34-13-8-22(26,27)9-14-34)15-36-10-2-5-21(36)6-11-35(12-7-21)20(37)38-19(23(28,29)30)24(31,32)33/h1,3-4,19H,2,5-15H2
US Patent
n/an/a>1.00E+3n/an/an/an/an/an/a
ABIDE THERAPEUTICS, INC.
US Patent
Assay Description
Proteomes (mouse brain membrane fraction or cell lysates) (50 μL, 1.0 mg/mL total protein concentration) were preincubated with varying concentr...
US Patent US10030020 (2018)
BindingDB Entry DOI: 10.7270/Q2FX7CGF