BDBM280575 US10030020, Example 120::US10781211, Example 120
SMILES: OC(=O)C1CCN(CC1)c1cc(Cl)ccc1CN1CCCC11CCN(CC1)C(=O)OC(C(F)(F)F)C(F)(F)F
InChI Key: InChIKey=NOKOSNZXBLCVQC-UHFFFAOYSA-N
Data: 8 IC50
Activity Spreadsheet -- Enzyme Inhibition Constant Data from BindingDB
Found 8 hits for monomerid = 280575
Trg + Lig
Ki
nM
ΔG°
kcal/mole
IC50
nM
Kd
nM
EC50/IC50
nM
koff
s-1
kon
M-1s-1
pHTemp
°C
Monoglyceride Lipase (MGL)
(Mus musculus (mouse))
BDBM280575
(US10030020, Example 120 | US10781211, Example 120)
Show SMILES OC(=O)C1CCN(CC1)c1cc(Cl)ccc1CN1CCCC11CCN(CC1)C(=O)OC(C(F)(F)F)C(F)(F)F
Show InChI InChI=1S/C25H30ClF6N3O4/c26-18-3-2-17(19(14-18)33-10-4-16(5-11-33)20(36)37)15-35-9-1-6-23(35)7-12-34(13-8-23)22(38)39-21(24(27,28)29)25(30,31)32/h2-3,14,16,21H,1,4-13,15H2,(H,36,37)
Reactome pathway
US Patent
n/an/a<100n/an/an/an/an/an/a
ABIDE THERAPEUTICS, INC.
US Patent
Assay Description
Proteomes (mouse brain membrane fraction or cell lysates) (50 μL, 1.0 mg/mL total protein concentration) were preincubated with varying concentr...
US Patent US10030020 (2018)
BindingDB Entry DOI: 10.7270/Q2FX7CGF
Anandamide amidohydrolase
(Mus musculus (mouse))
BDBM280575
(US10030020, Example 120 | US10781211, Example 120)
Show SMILES OC(=O)C1CCN(CC1)c1cc(Cl)ccc1CN1CCCC11CCN(CC1)C(=O)OC(C(F)(F)F)C(F)(F)F
Show InChI InChI=1S/C25H30ClF6N3O4/c26-18-3-2-17(19(14-18)33-10-4-16(5-11-33)20(36)37)15-35-9-1-6-23(35)7-12-34(13-8-23)22(38)39-21(24(27,28)29)25(30,31)32/h2-3,14,16,21H,1,4-13,15H2,(H,36,37)
US Patent
n/an/a>1.00E+3n/an/an/an/an/an/a
ABIDE THERAPEUTICS, INC.
US Patent
Assay Description
Proteomes (mouse brain membrane fraction or cell lysates) (50 μL, 1.0 mg/mL total protein concentration) were preincubated with varying concentr...
US Patent US10030020 (2018)
BindingDB Entry DOI: 10.7270/Q2FX7CGF
Monoacylglycerol lipase ABHD2
(Mus musculus (Mouse))
BDBM280575
(US10030020, Example 120 | US10781211, Example 120)
Show SMILES OC(=O)C1CCN(CC1)c1cc(Cl)ccc1CN1CCCC11CCN(CC1)C(=O)OC(C(F)(F)F)C(F)(F)F
Show InChI InChI=1S/C25H30ClF6N3O4/c26-18-3-2-17(19(14-18)33-10-4-16(5-11-33)20(36)37)15-35-9-1-6-23(35)7-12-34(13-8-23)22(38)39-21(24(27,28)29)25(30,31)32/h2-3,14,16,21H,1,4-13,15H2,(H,36,37)
US Patent
n/an/a>1.00E+3n/an/an/an/an/an/a
ABIDE THERAPEUTICS, INC.
US Patent
Assay Description
Proteomes (mouse brain membrane fraction or cell lysates) (50 μL, 1.0 mg/mL total protein concentration) were preincubated with varying concentr...
US Patent US10030020 (2018)
BindingDB Entry DOI: 10.7270/Q2FX7CGF
Monoglyceride lipase
(Homo sapiens (Human))
BDBM280575
(US10030020, Example 120 | US10781211, Example 120)
Show SMILES OC(=O)C1CCN(CC1)c1cc(Cl)ccc1CN1CCCC11CCN(CC1)C(=O)OC(C(F)(F)F)C(F)(F)F
Show InChI InChI=1S/C25H30ClF6N3O4/c26-18-3-2-17(19(14-18)33-10-4-16(5-11-33)20(36)37)15-35-9-1-6-23(35)7-12-34(13-8-23)22(38)39-21(24(27,28)29)25(30,31)32/h2-3,14,16,21H,1,4-13,15H2,(H,36,37)
Reactome pathway
US Patent
n/an/a<100n/an/an/an/an/an/a
LUNDBECK LA JOLLA RESEARCH CENTER, INC.
US Patent
Assay Description
Human: Proteomes (human prefrontal cortex or cell membrane fractions) (50 μL, 1.0-2.0 mg/mL total protein concentration) were preincubated with ...
US Patent US10781211 (2020)
Monoglyceride Lipase (MGL)
(Mus musculus (mouse))
BDBM280575
(US10030020, Example 120 | US10781211, Example 120)
Show SMILES OC(=O)C1CCN(CC1)c1cc(Cl)ccc1CN1CCCC11CCN(CC1)C(=O)OC(C(F)(F)F)C(F)(F)F
Show InChI InChI=1S/C25H30ClF6N3O4/c26-18-3-2-17(19(14-18)33-10-4-16(5-11-33)20(36)37)15-35-9-1-6-23(35)7-12-34(13-8-23)22(38)39-21(24(27,28)29)25(30,31)32/h2-3,14,16,21H,1,4-13,15H2,(H,36,37)
Reactome pathway
US Patent
n/an/a<100n/an/an/an/an/an/a
LUNDBECK LA JOLLA RESEARCH CENTER, INC.
US Patent
Assay Description
MAGL, ABHD6 and FAAH: Proteomes (mouse brain membrane fraction or cell lysates) (50 μL, 1.0 mg/mL total protein concentration) were preincubated...
US Patent US10781211 (2020)
Anandamide amidohydrolase
(Mus musculus (mouse))
BDBM280575
(US10030020, Example 120 | US10781211, Example 120)
Show SMILES OC(=O)C1CCN(CC1)c1cc(Cl)ccc1CN1CCCC11CCN(CC1)C(=O)OC(C(F)(F)F)C(F)(F)F
Show InChI InChI=1S/C25H30ClF6N3O4/c26-18-3-2-17(19(14-18)33-10-4-16(5-11-33)20(36)37)15-35-9-1-6-23(35)7-12-34(13-8-23)22(38)39-21(24(27,28)29)25(30,31)32/h2-3,14,16,21H,1,4-13,15H2,(H,36,37)
US Patent
n/an/a>1.00E+3n/an/an/an/an/an/a
LUNDBECK LA JOLLA RESEARCH CENTER, INC.
US Patent
Assay Description
MAGL, ABHD6 and FAAH: Proteomes (mouse brain membrane fraction or cell lysates) (50 μL, 1.0 mg/mL total protein concentration) were preincubated...
US Patent US10781211 (2020)
Monoacylglycerol lipase ABHD6
(Mus musculus (mouse))
BDBM280575
(US10030020, Example 120 | US10781211, Example 120)
Show SMILES OC(=O)C1CCN(CC1)c1cc(Cl)ccc1CN1CCCC11CCN(CC1)C(=O)OC(C(F)(F)F)C(F)(F)F
Show InChI InChI=1S/C25H30ClF6N3O4/c26-18-3-2-17(19(14-18)33-10-4-16(5-11-33)20(36)37)15-35-9-1-6-23(35)7-12-34(13-8-23)22(38)39-21(24(27,28)29)25(30,31)32/h2-3,14,16,21H,1,4-13,15H2,(H,36,37)
US Patent
n/an/a>1.00E+3n/an/an/an/an/an/a
LUNDBECK LA JOLLA RESEARCH CENTER, INC.
US Patent
Assay Description
MAGL, ABHD6 and FAAH: Proteomes (mouse brain membrane fraction or cell lysates) (50 μL, 1.0 mg/mL total protein concentration) were preincubated...
US Patent US10781211 (2020)
Monoglyceride lipase
(Homo sapiens (Human))
BDBM280575
(US10030020, Example 120 | US10781211, Example 120)
Show SMILES OC(=O)C1CCN(CC1)c1cc(Cl)ccc1CN1CCCC11CCN(CC1)C(=O)OC(C(F)(F)F)C(F)(F)F
Show InChI InChI=1S/C25H30ClF6N3O4/c26-18-3-2-17(19(14-18)33-10-4-16(5-11-33)20(36)37)15-35-9-1-6-23(35)7-12-34(13-8-23)22(38)39-21(24(27,28)29)25(30,31)32/h2-3,14,16,21H,1,4-13,15H2,(H,36,37)
Reactome pathway
US Patent
n/an/a<100n/an/an/an/an/a25
ABIDE THERAPEUTICS, INC.
US Patent
Assay Description
Proteomes (human prefrontal cortex or cell membrane fractions) (50 μL, 1.0-2.0 mg/mL total protein concentration) were preincubated with varying...
US Patent US10030020 (2018)
BindingDB Entry DOI: 10.7270/Q2FX7CGF