null
SMILES: Cc1ccc(CN2CCCC22CCN(CC2)C(=O)OC(C(F)(F)F)C(F)(F)F)cc1Cl
InChI Key: InChIKey=MYUURJTUCMZZDB-UHFFFAOYSA-N
Activity Spreadsheet -- Enzyme Inhibition Constant Data from BindingDB
Found 6 hits for monomerid = 280580
Trg + Lig
Ki
nM
ΔG°
kcal/mole
IC50
nM
Kd
nM
EC50/IC50
nM
koff
s-1
kon
M-1s-1
pHTemp
°C
Monoglyceride lipase
(Mus musculus (mouse))
BDBM280580
(US10030020, Example 125 | US10781211, Example 125)
Show SMILES Cc1ccc(CN2CCCC22CCN(CC2)C(=O)OC(C(F)(F)F)C(F)(F)F)cc1Cl
Show InChI InChI=1S/C20H23ClF6N2O2/c1-13-3-4-14(11-15(13)21)12-29-8-2-5-18(29)6-9-28(10-7-18)17(30)31-16(19(22,23)24)20(25,26)27/h3-4,11,16H,2,5-10,12H2,1H3
Reactome pathway
US Patent
n/an/a<100n/an/an/an/an/an/a
ABIDE THERAPEUTICS, INC.
US Patent
Assay Description
Proteomes (mouse brain membrane fraction or cell lysates) (50 μL, 1.0 mg/mL total protein concentration) were preincubated with varying concentr...
US Patent US10030020 (2018)
BindingDB Entry DOI: 10.7270/Q2FX7CGF
Fatty-acid amide hydrolase 1
(Mus musculus (mouse))
BDBM280580
(US10030020, Example 125 | US10781211, Example 125)
Show SMILES Cc1ccc(CN2CCCC22CCN(CC2)C(=O)OC(C(F)(F)F)C(F)(F)F)cc1Cl
Show InChI InChI=1S/C20H23ClF6N2O2/c1-13-3-4-14(11-15(13)21)12-29-8-2-5-18(29)6-9-28(10-7-18)17(30)31-16(19(22,23)24)20(25,26)27/h3-4,11,16H,2,5-10,12H2,1H3
US Patent
n/an/a>1.00E+3n/an/an/an/an/an/a
ABIDE THERAPEUTICS, INC.
US Patent
Assay Description
Proteomes (mouse brain membrane fraction or cell lysates) (50 μL, 1.0 mg/mL total protein concentration) were preincubated with varying concentr...
US Patent US10030020 (2018)
BindingDB Entry DOI: 10.7270/Q2FX7CGF
Monoacylglycerol lipase ABHD6
(Mus musculus (mouse))
BDBM280580
(US10030020, Example 125 | US10781211, Example 125)
Show SMILES Cc1ccc(CN2CCCC22CCN(CC2)C(=O)OC(C(F)(F)F)C(F)(F)F)cc1Cl
Show InChI InChI=1S/C20H23ClF6N2O2/c1-13-3-4-14(11-15(13)21)12-29-8-2-5-18(29)6-9-28(10-7-18)17(30)31-16(19(22,23)24)20(25,26)27/h3-4,11,16H,2,5-10,12H2,1H3
US Patent
n/an/a>1.00E+3n/an/an/an/an/an/a
LUNDBECK LA JOLLA RESEARCH CENTER, INC.
US Patent
Assay Description
MAGL, ABHD6 and FAAH: Proteomes (mouse brain membrane fraction or cell lysates) (50 μL, 1.0 mg/mL total protein concentration) were preincubated...
US Patent US10781211 (2020)
Monoglyceride lipase
(Mus musculus (mouse))
BDBM280580
(US10030020, Example 125 | US10781211, Example 125)
Show SMILES Cc1ccc(CN2CCCC22CCN(CC2)C(=O)OC(C(F)(F)F)C(F)(F)F)cc1Cl
Show InChI InChI=1S/C20H23ClF6N2O2/c1-13-3-4-14(11-15(13)21)12-29-8-2-5-18(29)6-9-28(10-7-18)17(30)31-16(19(22,23)24)20(25,26)27/h3-4,11,16H,2,5-10,12H2,1H3
Reactome pathway
US Patent
n/an/a<100n/an/an/an/an/an/a
LUNDBECK LA JOLLA RESEARCH CENTER, INC.
US Patent
Assay Description
MAGL, ABHD6 and FAAH: Proteomes (mouse brain membrane fraction or cell lysates) (50 μL, 1.0 mg/mL total protein concentration) were preincubated...
US Patent US10781211 (2020)
Fatty-acid amide hydrolase 1
(Mus musculus (mouse))
BDBM280580
(US10030020, Example 125 | US10781211, Example 125)
Show SMILES Cc1ccc(CN2CCCC22CCN(CC2)C(=O)OC(C(F)(F)F)C(F)(F)F)cc1Cl
Show InChI InChI=1S/C20H23ClF6N2O2/c1-13-3-4-14(11-15(13)21)12-29-8-2-5-18(29)6-9-28(10-7-18)17(30)31-16(19(22,23)24)20(25,26)27/h3-4,11,16H,2,5-10,12H2,1H3
US Patent
n/an/a>1.00E+3n/an/an/an/an/an/a
LUNDBECK LA JOLLA RESEARCH CENTER, INC.
US Patent
Assay Description
MAGL, ABHD6 and FAAH: Proteomes (mouse brain membrane fraction or cell lysates) (50 μL, 1.0 mg/mL total protein concentration) were preincubated...
US Patent US10781211 (2020)
Monoacylglycerol lipase ABHD2
(Mus musculus (Mouse))
BDBM280580
(US10030020, Example 125 | US10781211, Example 125)
Show SMILES Cc1ccc(CN2CCCC22CCN(CC2)C(=O)OC(C(F)(F)F)C(F)(F)F)cc1Cl
Show InChI InChI=1S/C20H23ClF6N2O2/c1-13-3-4-14(11-15(13)21)12-29-8-2-5-18(29)6-9-28(10-7-18)17(30)31-16(19(22,23)24)20(25,26)27/h3-4,11,16H,2,5-10,12H2,1H3
US Patent
n/an/a>1.00E+3n/an/an/an/an/an/a
ABIDE THERAPEUTICS, INC.
US Patent
Assay Description
Proteomes (mouse brain membrane fraction or cell lysates) (50 μL, 1.0 mg/mL total protein concentration) were preincubated with varying concentr...
US Patent US10030020 (2018)
BindingDB Entry DOI: 10.7270/Q2FX7CGF