BDBM280862 3-(2-{4-amino-2-[6- chloro-1-(2-fluorobenzyl)- 1H-indazol-3-yl]-5- cyclopropyl-6-oxo-6,7- dihydro-5H-pyrrolo[2,3- d]pyrimidin-5-yl}-1,3- oxazol-4-yl)-2,2- dimethylpropanoic acid::US10030027, Example 138B::US10428076, Example 138B
SMILES: CC(C)(Cc1coc(n1)C1(C2CC2)C(=O)Nc2nc(nc(N)c12)-c1nn(Cc2ccccc2F)c2cc(Cl)ccc12)C(O)=O
InChI Key: InChIKey=PXMDPPIMZDPVDE-UHFFFAOYSA-N
Data: 2 KI
Activity Spreadsheet -- Enzyme Inhibition Constant Data from BindingDB
Found 2 hits for monomerid = 280862
Trg + Lig
Ki
nM
ΔG°
kcal/mole
IC50
nM
Kd
nM
EC50/IC50
nM
koff
s-1
kon
M-1s-1
pHTemp
°C
Soluble Guanylate Cyclases
(Homo sapiens (Human))
BDBM280862
(3-(2-{4-amino-2-[6- chloro-1-(2-fluorobenzyl)- 1H-...)
Show SMILES CC(C)(Cc1coc(n1)C1(C2CC2)C(=O)Nc2nc(nc(N)c12)-c1nn(Cc2ccccc2F)c2cc(Cl)ccc12)C(O)=O
Show InChI InChI=1S/C31H27ClFN7O4/c1-30(2,29(42)43)12-18-14-44-28(35-18)31(16-7-8-16)22-24(34)36-26(37-25(22)38-27(31)41)23-19-10-9-17(32)11-21(19)40(39-23)13-15-5-3-4-6-20(15)33/h3-6,9-11,14,16H,7-8,12-13H2,1-2H3,(H,42,43)(H3,34,36,37,38,41)
US Patent
0.0580n/an/an/an/an/an/an/an/a
Merck Sharp & Dohme Corp.
US Patent
Assay Description
The binding buffer was composed of 50 mM triethanolamine, pH 7.4, 3 mM MgCl2, 0.025% BSA, 2 mM dithiothreitol (DTT), 300 μM DETA/NO and 400 _...
US Patent US10428076 (2019)
BindingDB Entry DOI: 10.7270/Q22N54P9
Guanylate cyclase soluble subunit alpha-1
(Homo sapiens (Human))
BDBM280862
(3-(2-{4-amino-2-[6- chloro-1-(2-fluorobenzyl)- 1H-...)
Show SMILES CC(C)(Cc1coc(n1)C1(C2CC2)C(=O)Nc2nc(nc(N)c12)-c1nn(Cc2ccccc2F)c2cc(Cl)ccc12)C(O)=O
Show InChI InChI=1S/C31H27ClFN7O4/c1-30(2,29(42)43)12-18-14-44-28(35-18)31(16-7-8-16)22-24(34)36-26(37-25(22)38-27(31)41)23-19-10-9-17(32)11-21(19)40(39-23)13-15-5-3-4-6-20(15)33/h3-6,9-11,14,16H,7-8,12-13H2,1-2H3,(H,42,43)(H3,34,36,37,38,41)
US Patent
0.0580n/an/an/an/an/an/a7.4n/a
Merck Sharp & Dohme Corp.
US Patent
Assay Description
The binding potencies of sGC compounds to the human recombinant sGC enzyme were determined in a Size Exclusion Chromatography (SEC) competition bindi...
US Patent US10030027 (2018)
BindingDB Entry DOI: 10.7270/Q22N549C