BDBM2809 Alkenyldiarylmethanes (ADAM) 6b::CHEMBL105859::Methyl (5Z)-6-(3,4-dimethoxyphenyl)-6-[4-methoxy-3-(methoxycarbonyl)-5-methylphenyl]hex-5-enoate::methyl 5-[(1E)-1-(3,4-dimethoxyphenyl)-6-methoxy-6-oxohex-1-en-1-yl]-2-methoxy-3-methylbenzoate
SMILES: COC(=O)CCC\C=C(\c1ccc(OC)c(OC)c1)c1cc(C)c(OC)c(c1)C(=O)OC
InChI Key: InChIKey=WNKWNLLPIAKZAB-OCKHKDLRSA-N
Data: 2 IC50
Activity Spreadsheet -- Enzyme Inhibition Constant Data from BindingDB
Found 2 hits for monomerid = 2809
Trg + Lig
Ki
nM
ΔG°
kcal/mole
IC50
nM
Kd
nM
EC50/IC50
nM
koff
s-1
kon
M-1s-1
pHTemp
°C
Human immunodeficiency virus type 1 reverse transcriptase
(Human immunodeficiency virus 1)
BDBM2809
(Alkenyldiarylmethanes (ADAM) 6b | CHEMBL105859 | M...)
Show SMILES COC(=O)CCC\C=C(\c1ccc(OC)c(OC)c1)c1cc(C)c(OC)c(c1)C(=O)OC
Show InChI InChI=1S/C25H30O7/c1-16-13-18(14-20(24(16)31-5)25(27)32-6)19(9-7-8-10-23(26)30-4)17-11-12-21(28-2)22(15-17)29-3/h9,11-15H,7-8,10H2,1-6H3/b19-9-
n/an/a 74n/an/an/an/an/an/a
Purdue University
Curated by ChEMBL
Assay Description
Inhibition of recombinant HIV-1 reverse transcriptase activity
J Med Chem 48: 6140-55 (2005)
Article DOI: 10.1021/jm050452s
BindingDB Entry DOI: 10.7270/Q2TB16F6
HIV-1 Reverse Transcriptase
(Human immunodeficiency virus type 1)
BDBM2809
(Alkenyldiarylmethanes (ADAM) 6b | CHEMBL105859 | M...)
Show SMILES COC(=O)CCC\C=C(\c1ccc(OC)c(OC)c1)c1cc(C)c(OC)c(c1)C(=O)OC
Show InChI InChI=1S/C25H30O7/c1-16-13-18(14-20(24(16)31-5)25(27)32-6)19(9-7-8-10-23(26)30-4)17-11-12-21(28-2)22(15-17)29-3/h9,11-15H,7-8,10H2,1-6H3/b19-9-
n/an/a 74n/an/an/an/a7.9n/a
Purdue University
Assay Description
The IC50 of reverse transcriptase is the concentration that inhibits 50% of recombinant HIV-1 RT RNA-directed DNA polymerase activity in vitro.
Bioorg Med Chem 10: 283-90 (2002)
Article DOI: 10.1016/s0968-0896(01)00282-6
BindingDB Entry DOI: 10.7270/Q2SQ8XM8