BDBM280950 3-(2-{4-amino-2- [1-(cyclohexyl- methyl)-1H- indazol-3-yl]-5- methyl-6-oxo- 6,7-dihydro-5H- pyrrolo[2,3-d] pyrimidin-5-yl}- 1,3-oxazol-4-yl)- 2,2-dimethyl- propanoic acid::US10030027, Example 228A::US10428076, Example 228A
SMILES: CC(C)(Cc1coc(n1)C1(C)C(=O)Nc2nc(nc(N)c12)-c1nn(CC2CCCCC2)c2ccccc12)C(O)=O
InChI Key: InChIKey=RHIUWUASOQVXNT-UHFFFAOYSA-N
Data: 2 KI
Activity Spreadsheet -- Enzyme Inhibition Constant Data from BindingDB
Found 2 hits for monomerid = 280950
Trg + Lig
Ki
nM
ΔG°
kcal/mole
IC50
nM
Kd
nM
EC50/IC50
nM
koff
s-1
kon
M-1s-1
pHTemp
°C
Soluble Guanylate Cyclases
(Homo sapiens (Human))
BDBM280950
(3-(2-{4-amino-2- [1-(cyclohexyl- methyl)-1H- indaz...)
Show SMILES CC(C)(Cc1coc(n1)C1(C)C(=O)Nc2nc(nc(N)c12)-c1nn(CC2CCCCC2)c2ccccc12)C(O)=O
Show InChI InChI=1S/C29H33N7O4/c1-28(2,27(38)39)13-17-15-40-26(31-17)29(3)20-22(30)32-24(33-23(20)34-25(29)37)21-18-11-7-8-12-19(18)36(35-21)14-16-9-5-4-6-10-16/h7-8,11-12,15-16H,4-6,9-10,13-14H2,1-3H3,(H,38,39)(H3,30,32,33,34,37)
US Patent
0.0790n/an/an/an/an/an/an/an/a
Merck Sharp & Dohme Corp.
US Patent
Assay Description
The binding buffer was composed of 50 mM triethanolamine, pH 7.4, 3 mM MgCl2, 0.025% BSA, 2 mM dithiothreitol (DTT), 300 μM DETA/NO and 400 _...
US Patent US10428076 (2019)
BindingDB Entry DOI: 10.7270/Q22N54P9
Guanylate cyclase soluble subunit alpha-1
(Homo sapiens (Human))
BDBM280950
(3-(2-{4-amino-2- [1-(cyclohexyl- methyl)-1H- indaz...)
Show SMILES CC(C)(Cc1coc(n1)C1(C)C(=O)Nc2nc(nc(N)c12)-c1nn(CC2CCCCC2)c2ccccc12)C(O)=O
Show InChI InChI=1S/C29H33N7O4/c1-28(2,27(38)39)13-17-15-40-26(31-17)29(3)20-22(30)32-24(33-23(20)34-25(29)37)21-18-11-7-8-12-19(18)36(35-21)14-16-9-5-4-6-10-16/h7-8,11-12,15-16H,4-6,9-10,13-14H2,1-3H3,(H,38,39)(H3,30,32,33,34,37)
US Patent
0.0790n/an/an/an/an/an/a7.4n/a
Merck Sharp & Dohme Corp.
US Patent
Assay Description
The binding potencies of sGC compounds to the human recombinant sGC enzyme were determined in a Size Exclusion Chromatography (SEC) competition bindi...
US Patent US10030027 (2018)
BindingDB Entry DOI: 10.7270/Q22N549C