BDBM281100 US10022354, Example 40
SMILES: CC(C)c1cc([nH]n1)C(=O)N1CCC(C1)n1cccc(C)c1=O
InChI Key: InChIKey=RGJCGGRMPCGWKX-UHFFFAOYSA-N
Data: 1 IC50
Activity Spreadsheet -- Enzyme Inhibition Constant Data from BindingDB
Found 1 hit for monomerid = 281100
Trg + Lig
Ki
nM
ΔG°
kcal/mole
IC50
nM
Kd
nM
EC50/IC50
nM
koff
s-1
kon
M-1s-1
pHTemp
°C
Lysine-specific demethylase 5A
(Homo sapiens (Human))
BDBM281100
(US10022354, Example 40)
Show SMILES CC(C)c1cc([nH]n1)C(=O)N1CCC(C1)n1cccc(C)c1=O
Show InChI InChI=1S/C17H22N4O2/c1-11(2)14-9-15(19-18-14)17(23)20-8-6-13(10-20)21-7-4-5-12(3)16(21)22/h4-5,7,9,11,13H,6,8,10H2,1-3H3,(H,18,19)
Reactome pathway
US Patent
n/an/a 0.0580n/an/an/an/a7.025
GENENTECH, INC.; CONSTELLATION PHARMACEUTICALS INC.
US Patent
Assay Description
Full length KDM5A enzyme was expressed and purified inhouse. Biotin-H3K4me3 peptide was purchased from New England Biolabs. HTRF reagents (containing...
US Patent US10022354 (2018)
BindingDB Entry DOI: 10.7270/Q2PC34F7