BDBM281188 US10022354, Example 128
SMILES: CC(C)c1cc([nH]n1)C(=O)N1CCC(C1)NC(=O)C1(C)CC1
InChI Key: InChIKey=PVVAPJURUJKQIU-UHFFFAOYSA-N
Data: 1 IC50
Activity Spreadsheet -- Enzyme Inhibition Constant Data from BindingDB
Found 1 hit for monomerid = 281188
Trg + Lig
Ki
nM
ΔG°
kcal/mole
IC50
nM
Kd
nM
EC50/IC50
nM
koff
s-1
kon
M-1s-1
pHTemp
°C
Lysine-specific demethylase 5A
(Homo sapiens (Human))
BDBM281188
(US10022354, Example 128)
Show SMILES CC(C)c1cc([nH]n1)C(=O)N1CCC(C1)NC(=O)C1(C)CC1
Show InChI InChI=1S/C16H24N4O2/c1-10(2)12-8-13(19-18-12)14(21)20-7-4-11(9-20)17-15(22)16(3)5-6-16/h8,10-11H,4-7,9H2,1-3H3,(H,17,22)(H,18,19)
Reactome pathway
US Patent
n/an/a 0.0590n/an/an/an/a7.025
GENENTECH, INC.; CONSTELLATION PHARMACEUTICALS INC.
US Patent
Assay Description
Full length KDM5A enzyme was expressed and purified inhouse. Biotin-H3K4me3 peptide was purchased from New England Biolabs. HTRF reagents (containing...
US Patent US10022354 (2018)
BindingDB Entry DOI: 10.7270/Q2PC34F7