BDBM28158 5-(1H-1,3-benzodiazol-1-yl)-3-[(3-methylphenyl)methoxy]thiophene-2-carboxamide::benzimidazole thiophene analogue, 8
SMILES: Cc1cccc(COc2cc(sc2C(N)=O)-n2cnc3ccccc23)c1
InChI Key: InChIKey=UGQFNSQKIGSKJD-UHFFFAOYSA-N
Data: 1 IC50
Activity Spreadsheet -- Enzyme Inhibition Constant Data from BindingDB
Found 1 hit for monomerid = 28158
Trg + Lig
Ki
nM
ΔG°
kcal/mole
IC50
nM
Kd
nM
EC50/IC50
nM
koff
s-1
kon
M-1s-1
pHTemp
°C
Serine/threonine-protein kinase PLK1
(Homo sapiens (Human))
BDBM28158
(5-(1H-1,3-benzodiazol-1-yl)-3-[(3-methylphenyl)met...)
Show SMILES Cc1cccc(COc2cc(sc2C(N)=O)-n2cnc3ccccc23)c1
Show InChI InChI=1S/C20H17N3O2S/c1-13-5-4-6-14(9-13)11-25-17-10-18(26-19(17)20(21)24)23-12-22-15-7-2-3-8-16(15)23/h2-10,12H,11H2,1H3,(H2,21,24)
NCI pathway
Reactome pathway
n/an/a 12n/an/an/an/a7.222
GSK
Assay Description
The compound inhibitory activity was determined by incubation with purified PLK enzyme and biotinylated peptide substrate in the presence ATP/[gamma-...
Bioorg Med Chem Lett 19: 1018-21 (2009)
Article DOI: 10.1016/j.bmcl.2008.11.041
BindingDB Entry DOI: 10.7270/Q26T0JZX