BDBM281605 US10022461, Compound 55
SMILES: FCOc1cccc2cc(ncc12)-n1ccc2ccncc12
InChI Key: InChIKey=SCQYAKKBVYMNOM-UHFFFAOYSA-N
Data: 1 KI
Activity Spreadsheet -- Enzyme Inhibition Constant Data from BindingDB
Found 1 hit for monomerid = 281605
Trg + Lig
Ki
nM
ΔG°
kcal/mole
IC50
nM
Kd
nM
EC50/IC50
nM
koff
s-1
kon
M-1s-1
pHTemp
°C
Microtubule-associated protein tau
(Homo sapiens (Human))
BDBM281605
(US10022461, Compound 55)
Show SMILES FCOc1cccc2cc(ncc12)-n1ccc2ccncc12
Show InChI InChI=1S/C17H12FN3O/c18-11-22-16-3-1-2-13-8-17(20-9-14(13)16)21-7-5-12-4-6-19-10-15(12)21/h1-10H,11H2
US Patent
1.14 -12.2n/an/an/an/an/a7.425
Merck Sharp & Dohme Corp.
US Patent
Assay Description
For displacement tau binding assay, unlabeled test compounds were dissolved in DMSO at 1 mM. Dilutions of tests compounds to various concentrations w...
US Patent US10022461 (2018)
BindingDB Entry DOI: 10.7270/Q2959KK6