BDBM281609 US10022461, Compound 59
SMILES: Nc1cccc2cc(ncc12)-n1ccc2ccncc12
InChI Key: InChIKey=DHRFXRSDDPBSHG-UHFFFAOYSA-N
Data: 1 KI
Activity Spreadsheet -- Enzyme Inhibition Constant Data from BindingDB
Found 1 hit for monomerid = 281609
Trg + Lig
Ki
nM
ΔG°
kcal/mole
IC50
nM
Kd
nM
EC50/IC50
nM
koff
s-1
kon
M-1s-1
pHTemp
°C
Microtubule-associated protein tau
(Homo sapiens (Human))
BDBM281609
(US10022461, Compound 59)
Show SMILES Nc1cccc2cc(ncc12)-n1ccc2ccncc12
Show InChI InChI=1S/C16H12N4/c17-14-3-1-2-12-8-16(19-9-13(12)14)20-7-5-11-4-6-18-10-15(11)20/h1-10H,17H2
US Patent
0.330 -12.9n/an/an/an/an/a7.425
Merck Sharp & Dohme Corp.
US Patent
Assay Description
For displacement tau binding assay, unlabeled test compounds were dissolved in DMSO at 1 mM. Dilutions of tests compounds to various concentrations w...
US Patent US10022461 (2018)
BindingDB Entry DOI: 10.7270/Q2959KK6