BDBM28162 5-(1H-1,3-benzodiazol-1-yl)-3-[(2-chlorophenyl)methoxy]thiophene-2-carboxamide::benzimidazole thiophene analogue, 13
SMILES: NC(=O)c1sc(cc1OCc1ccccc1Cl)-n1cnc2ccccc12
InChI Key: InChIKey=RGXPTTVHZKAPKA-UHFFFAOYSA-N
Data: 1 IC50
PDB links: 1 PDB ID contains inhibitors having a similarity of 90% to this monomer.
Activity Spreadsheet -- Enzyme Inhibition Constant Data from BindingDB
Found 1 hit for monomerid = 28162
Trg + Lig
Ki
nM
ΔG°
kcal/mole
IC50
nM
Kd
nM
EC50/IC50
nM
koff
s-1
kon
M-1s-1
pHTemp
°C
Serine/threonine-protein kinase PLK1
(Homo sapiens (Human))
BDBM28162
(5-(1H-1,3-benzodiazol-1-yl)-3-[(2-chlorophenyl)met...)
Show SMILES NC(=O)c1sc(cc1OCc1ccccc1Cl)-n1cnc2ccccc12
Show InChI InChI=1S/C19H14ClN3O2S/c20-13-6-2-1-5-12(13)10-25-16-9-17(26-18(16)19(21)24)23-11-22-14-7-3-4-8-15(14)23/h1-9,11H,10H2,(H2,21,24)
NCI pathway
Reactome pathway
n/an/a 12n/an/an/an/a7.222
GSK
Assay Description
The compound inhibitory activity was determined by incubation with purified PLK enzyme and biotinylated peptide substrate in the presence ATP/[gamma-...
Bioorg Med Chem Lett 19: 1018-21 (2009)
Article DOI: 10.1016/j.bmcl.2008.11.041
BindingDB Entry DOI: 10.7270/Q26T0JZX