BDBM281628 US10022461, Compound 95
SMILES: CN(C)c1ccc(cn1)-c1ccc(nc1)-n1ccc2ccncc12
InChI Key: InChIKey=QFUJITMJJQZTBU-UHFFFAOYSA-N
Data: 1 KI
Activity Spreadsheet -- Enzyme Inhibition Constant Data from BindingDB
Found 1 hit for monomerid = 281628
Trg + Lig
Ki
nM
ΔG°
kcal/mole
IC50
nM
Kd
nM
EC50/IC50
nM
koff
s-1
kon
M-1s-1
pHTemp
°C
Microtubule-associated protein tau
(Homo sapiens (Human))
BDBM281628
(US10022461, Compound 95)
Show SMILES CN(C)c1ccc(cn1)-c1ccc(nc1)-n1ccc2ccncc12
Show InChI InChI=1S/C19H17N5/c1-23(2)18-5-3-15(11-21-18)16-4-6-19(22-12-16)24-10-8-14-7-9-20-13-17(14)24/h3-13H,1-2H3
US Patent
0.960 -12.3n/an/an/an/an/a7.425
Merck Sharp & Dohme Corp.
US Patent
Assay Description
For displacement tau binding assay, unlabeled test compounds were dissolved in DMSO at 1 mM. Dilutions of tests compounds to various concentrations w...
US Patent US10022461 (2018)
BindingDB Entry DOI: 10.7270/Q2959KK6