BDBM281635 US10022461, Compound 105
SMILES: Nc1cc2cnc(cc2cc1F)-n1ccc2ccncc12
InChI Key: InChIKey=BNBYJXMMWPMUPJ-UHFFFAOYSA-N
Data: 1 KI
Activity Spreadsheet -- Enzyme Inhibition Constant Data from BindingDB
Found 1 hit for monomerid = 281635
Trg + Lig
Ki
nM
ΔG°
kcal/mole
IC50
nM
Kd
nM
EC50/IC50
nM
koff
s-1
kon
M-1s-1
pHTemp
°C
Microtubule-associated protein tau
(Homo sapiens (Human))
BDBM281635
(US10022461, Compound 105)
Show SMILES Nc1cc2cnc(cc2cc1F)-n1ccc2ccncc12
Show InChI InChI=1S/C16H11FN4/c17-13-5-11-7-16(20-8-12(11)6-14(13)18)21-4-2-10-1-3-19-9-15(10)21/h1-9H,18H2
US Patent
0.383 -12.8n/an/an/an/an/a7.425
Merck Sharp & Dohme Corp.
US Patent
Assay Description
For displacement tau binding assay, unlabeled test compounds were dissolved in DMSO at 1 mM. Dilutions of tests compounds to various concentrations w...
US Patent US10022461 (2018)
BindingDB Entry DOI: 10.7270/Q2959KK6