BDBM28174 5-(5-methoxy-1H-1,3-benzodiazol-1-yl)-3-{[2-(trifluoromethyl)phenyl]methoxy}thiophene-2-carboxamide::benzimidazole thiophene analogue, 25
SMILES: COc1ccc2n(cnc2c1)-c1cc(OCc2ccccc2C(F)(F)F)c(s1)C(N)=O
InChI Key: InChIKey=VEUXEULZTVVJRP-UHFFFAOYSA-N
Data: 1 IC50
Activity Spreadsheet -- Enzyme Inhibition Constant Data from BindingDB
Found 1 hit for monomerid = 28174
Trg + Lig
Ki
nM
ΔG°
kcal/mole
IC50
nM
Kd
nM
EC50/IC50
nM
koff
s-1
kon
M-1s-1
pHTemp
°C
Serine/threonine-protein kinase PLK1
(Homo sapiens (Human))
BDBM28174
(5-(5-methoxy-1H-1,3-benzodiazol-1-yl)-3-{[2-(trifl...)
Show SMILES COc1ccc2n(cnc2c1)-c1cc(OCc2ccccc2C(F)(F)F)c(s1)C(N)=O
Show InChI InChI=1S/C21H16F3N3O3S/c1-29-13-6-7-16-15(8-13)26-11-27(16)18-9-17(19(31-18)20(25)28)30-10-12-4-2-3-5-14(12)21(22,23)24/h2-9,11H,10H2,1H3,(H2,25,28)
NCI pathway
Reactome pathway
n/an/a 8n/an/an/an/a7.222
GSK
Assay Description
The compound inhibitory activity was determined by incubation with purified PLK enzyme and biotinylated peptide substrate in the presence ATP/[gamma-...
Bioorg Med Chem Lett 19: 1018-21 (2009)
Article DOI: 10.1016/j.bmcl.2008.11.041
BindingDB Entry DOI: 10.7270/Q26T0JZX