BDBM28175 5-(6-methoxy-1H-1,3-benzodiazol-1-yl)-3-{[2-(trifluoromethyl)phenyl]methoxy}thiophene-2-carboxamide::benzimidazole thiophene analogue, 26
SMILES: COc1ccc2ncn(-c3cc(OCc4ccccc4C(F)(F)F)c(s3)C(N)=O)c2c1
InChI Key: InChIKey=CZFBBQGDVUHJKQ-UHFFFAOYSA-N
Data: 1 IC50
Activity Spreadsheet -- Enzyme Inhibition Constant Data from BindingDB
Found 1 hit for monomerid = 28175
Trg + Lig
Ki
nM
ΔG°
kcal/mole
IC50
nM
Kd
nM
EC50/IC50
nM
koff
s-1
kon
M-1s-1
pHTemp
°C
Serine/threonine-protein kinase PLK1
(Homo sapiens (Human))
BDBM28175
(5-(6-methoxy-1H-1,3-benzodiazol-1-yl)-3-{[2-(trifl...)
Show SMILES COc1ccc2ncn(-c3cc(OCc4ccccc4C(F)(F)F)c(s3)C(N)=O)c2c1
Show InChI InChI=1S/C21H16F3N3O3S/c1-29-13-6-7-15-16(8-13)27(11-26-15)18-9-17(19(31-18)20(25)28)30-10-12-4-2-3-5-14(12)21(22,23)24/h2-9,11H,10H2,1H3,(H2,25,28)
NCI pathway
Reactome pathway
n/an/a 2n/an/an/an/a7.222
GSK
Assay Description
The compound inhibitory activity was determined by incubation with purified PLK enzyme and biotinylated peptide substrate in the presence ATP/[gamma-...
Bioorg Med Chem Lett 19: 1018-21 (2009)
Article DOI: 10.1016/j.bmcl.2008.11.041
BindingDB Entry DOI: 10.7270/Q26T0JZX