BDBM28177 3-[(2-bromophenyl)methoxy]-5-(5,6-dimethoxy-1H-1,3-benzodiazol-1-yl)thiophene-2-carboxamide::benzimidazole thiophene analogue, 28
SMILES: COc1cc2ncn(-c3cc(OCc4ccccc4Br)c(s3)C(N)=O)c2cc1OC
InChI Key: InChIKey=TUIAPCRJMAZDMG-UHFFFAOYSA-N
Data: 1 IC50
Activity Spreadsheet -- Enzyme Inhibition Constant Data from BindingDB
Found 1 hit for monomerid = 28177
Trg + Lig
Ki
nM
ΔG°
kcal/mole
IC50
nM
Kd
nM
EC50/IC50
nM
koff
s-1
kon
M-1s-1
pHTemp
°C
Serine/threonine-protein kinase PLK1
(Homo sapiens (Human))
BDBM28177
(3-[(2-bromophenyl)methoxy]-5-(5,6-dimethoxy-1H-1,3...)
Show SMILES COc1cc2ncn(-c3cc(OCc4ccccc4Br)c(s3)C(N)=O)c2cc1OC
Show InChI InChI=1S/C21H18BrN3O4S/c1-27-16-7-14-15(8-17(16)28-2)25(11-24-14)19-9-18(20(30-19)21(23)26)29-10-12-5-3-4-6-13(12)22/h3-9,11H,10H2,1-2H3,(H2,23,26)
NCI pathway
Reactome pathway
n/an/a 2n/an/an/an/a7.222
GSK
Assay Description
The compound inhibitory activity was determined by incubation with purified PLK enzyme and biotinylated peptide substrate in the presence ATP/[gamma-...
Bioorg Med Chem Lett 19: 1018-21 (2009)
Article DOI: 10.1016/j.bmcl.2008.11.041
BindingDB Entry DOI: 10.7270/Q26T0JZX