BDBM28182 5-(5,6-dimethoxy-1H-1,3-benzodiazol-1-yl)-3-{[2-(trifluoromethoxy)phenyl]methoxy}thiophene-2-carboxamide::benzimidazole thiophene analogue, 33
SMILES: COc1cc2ncn(-c3cc(OCc4ccccc4OC(F)(F)F)c(s3)C(N)=O)c2cc1OC
InChI Key: InChIKey=HHJNULHGUASGCC-UHFFFAOYSA-N
Data: 1 IC50
Activity Spreadsheet -- Enzyme Inhibition Constant Data from BindingDB
Found 1 hit for monomerid = 28182
Trg + Lig
Ki
nM
ΔG°
kcal/mole
IC50
nM
Kd
nM
EC50/IC50
nM
koff
s-1
kon
M-1s-1
pHTemp
°C
Serine/threonine-protein kinase PLK1
(Homo sapiens (Human))
BDBM28182
(5-(5,6-dimethoxy-1H-1,3-benzodiazol-1-yl)-3-{[2-(t...)
Show SMILES COc1cc2ncn(-c3cc(OCc4ccccc4OC(F)(F)F)c(s3)C(N)=O)c2cc1OC
Show InChI InChI=1S/C22H18F3N3O5S/c1-30-16-7-13-14(8-17(16)31-2)28(11-27-13)19-9-18(20(34-19)21(26)29)32-10-12-5-3-4-6-15(12)33-22(23,24)25/h3-9,11H,10H2,1-2H3,(H2,26,29)
NCI pathway
Reactome pathway
n/an/a 5n/an/an/an/an/an/a
GSK
Assay Description
The compound inhibitory activity was determined by incubation with purified PLK enzyme and biotinylated peptide substrate in the presence ATP/[gamma-...
Bioorg Med Chem Lett 19: 1018-21 (2009)
Article DOI: 10.1016/j.bmcl.2008.11.041
BindingDB Entry DOI: 10.7270/Q26T0JZX