BDBM28194 3-[(3-chlorothiophen-2-yl)methoxy]-5-(5,6-dimethoxy-1H-1,3-benzodiazol-1-yl)thiophene-2-carboxamide::benzimidazole thiophene analogue, 46
SMILES: COc1cc2ncn(-c3cc(OCc4sccc4Cl)c(s3)C(N)=O)c2cc1OC
InChI Key: InChIKey=ZTWJDVNPCLUQPU-UHFFFAOYSA-N
Data: 1 IC50
Activity Spreadsheet -- Enzyme Inhibition Constant Data from BindingDB
Found 1 hit for monomerid = 28194
Trg + Lig
Ki
nM
ΔG°
kcal/mole
IC50
nM
Kd
nM
EC50/IC50
nM
koff
s-1
kon
M-1s-1
pHTemp
°C
Serine/threonine-protein kinase PLK1
(Homo sapiens (Human))
BDBM28194
(3-[(3-chlorothiophen-2-yl)methoxy]-5-(5,6-dimethox...)
Show SMILES COc1cc2ncn(-c3cc(OCc4sccc4Cl)c(s3)C(N)=O)c2cc1OC
Show InChI InChI=1S/C19H16ClN3O4S2/c1-25-13-5-11-12(6-14(13)26-2)23(9-22-11)17-7-15(18(29-17)19(21)24)27-8-16-10(20)3-4-28-16/h3-7,9H,8H2,1-2H3,(H2,21,24)
NCI pathway
Reactome pathway
n/an/a 2n/an/an/an/an/an/a
GSK
Assay Description
The compound inhibitory activity was determined by incubation with purified PLK enzyme and biotinylated peptide substrate in the presence ATP/[gamma-...
Bioorg Med Chem Lett 19: 1018-21 (2009)
Article DOI: 10.1016/j.bmcl.2008.11.041
BindingDB Entry DOI: 10.7270/Q26T0JZX