BDBM28217 3-[(1R)-1-(2-chlorophenyl)ethoxy]-5-{6-[(1-methylpiperidin-4-yl)oxy]-1H-1,3-benzodiazol-1-yl}thiophene-2-carboxamide::benzimidazole thiophene carboxamide, 25
SMILES: C[C@@H](Oc1cc(sc1C(N)=O)-n1cnc2ccc(OC3CCN(C)CC3)cc12)c1ccccc1Cl
InChI Key: InChIKey=GILNGUYOGYOZMP-MRXNPFEDSA-N
Data: 2 IC50
Activity Spreadsheet -- Enzyme Inhibition Constant Data from BindingDB
Found 2 hits for monomerid = 28217
Trg + Lig
Ki
nM
ΔG°
kcal/mole
IC50
nM
Kd
nM
EC50/IC50
nM
koff
s-1
kon
M-1s-1
pHTemp
°C
Serine/threonine-protein kinase PLK3
(Homo sapiens (Human))
BDBM28217
(3-[(1R)-1-(2-chlorophenyl)ethoxy]-5-{6-[(1-methylp...)
Show SMILES C[C@@H](Oc1cc(sc1C(N)=O)-n1cnc2ccc(OC3CCN(C)CC3)cc12)c1ccccc1Cl |r|
Show InChI InChI=1S/C26H27ClN4O3S/c1-16(19-5-3-4-6-20(19)27)33-23-14-24(35-25(23)26(28)32)31-15-29-21-8-7-18(13-22(21)31)34-17-9-11-30(2)12-10-17/h3-8,13-17H,9-12H2,1-2H3,(H2,28,32)/t16-/m1/s1
NCI pathway
n/an/a 630n/an/an/an/a7.222
GSK
Assay Description
The compound inhibitory activity was determined by incubation with purified PLK enzyme and biotinylated peptide substrate in the presence ATP/[gamma-...
Bioorg Med Chem Lett 19: 1694-7 (2009)
Article DOI: 10.1016/j.bmcl.2009.01.094
BindingDB Entry DOI: 10.7270/Q2319T6X
Serine/threonine-protein kinase PLK1
(Homo sapiens (Human))
BDBM28217
(3-[(1R)-1-(2-chlorophenyl)ethoxy]-5-{6-[(1-methylp...)
Show SMILES C[C@@H](Oc1cc(sc1C(N)=O)-n1cnc2ccc(OC3CCN(C)CC3)cc12)c1ccccc1Cl |r|
Show InChI InChI=1S/C26H27ClN4O3S/c1-16(19-5-3-4-6-20(19)27)33-23-14-24(35-25(23)26(28)32)31-15-29-21-8-7-18(13-22(21)31)34-17-9-11-30(2)12-10-17/h3-8,13-17H,9-12H2,1-2H3,(H2,28,32)/t16-/m1/s1
NCI pathway
Reactome pathway
n/an/a 2n/an/an/an/a7.222
GSK
Assay Description
The compound inhibitory activity was determined by incubation with purified PLK enzyme and biotinylated peptide substrate in the presence ATP/[gamma-...
Bioorg Med Chem Lett 19: 1694-7 (2009)
Article DOI: 10.1016/j.bmcl.2009.01.094
BindingDB Entry DOI: 10.7270/Q2319T6X