BDBM282968 6-(1-cyclobutyl-4-(4-fluorophenyl)-1H-imidazol-5- yl)imidazo[1,2-a]pyridine-3-carboxamide::US10287295, Example 172'::US9884868, Example 172'
SMILES: NC(=O)c1cnc2ccc(cn12)-c1c(ncn1C1CCC1)-c1ccc(F)cc1
InChI Key: InChIKey=FTCVMGYNDFLVEU-UHFFFAOYSA-N
Data: 4 IC50
Activity Spreadsheet -- Enzyme Inhibition Constant Data from BindingDB
Found 4 hits for monomerid = 282968
Trg + Lig
Ki
nM
ΔG°
kcal/mole
IC50
nM
Kd
nM
EC50/IC50
nM
koff
s-1
kon
M-1s-1
pHTemp
°C
TGF-beta receptor type-1
(Homo sapiens (Human))
BDBM282968
(6-(1-cyclobutyl-4-(4-fluorophenyl)-1H-imidazol-5- ...)
Show SMILES NC(=O)c1cnc2ccc(cn12)-c1c(ncn1C1CCC1)-c1ccc(F)cc1
Show InChI InChI=1S/C21H18FN5O/c22-15-7-4-13(5-8-15)19-20(27(12-25-19)16-2-1-3-16)14-6-9-18-24-10-17(21(23)28)26(18)11-14/h4-12,16H,1-3H2,(H2,23,28)
US Patent
n/an/a 0.5n/an/an/an/a7.425
Rigel Pharmaceuticals, Inc.; Bristol-Myers Squibb Company
US Patent
Assay Description
Assays for the compounds reported below were conducted in 1536-well plates and 2 mL reactions are prepared from addition of HIS-TGF-βR1 T204D or...
US Patent US9884868 (2018)
BindingDB Entry DOI: 10.7270/Q20P122M
TGF-beta receptor type II
(Homo sapiens (Human))
BDBM282968
(6-(1-cyclobutyl-4-(4-fluorophenyl)-1H-imidazol-5- ...)
Show SMILES NC(=O)c1cnc2ccc(cn12)-c1c(ncn1C1CCC1)-c1ccc(F)cc1
Show InChI InChI=1S/C21H18FN5O/c22-15-7-4-13(5-8-15)19-20(27(12-25-19)16-2-1-3-16)14-6-9-18-24-10-17(21(23)28)26(18)11-14/h4-12,16H,1-3H2,(H2,23,28)
NCI pathway
Reactome pathway
US Patent
n/an/a 1.74E+3n/an/an/an/an/an/a
University of Wisconsin at Madison
Assay Description
Assays for the compounds reported below were conducted in 1536-well plates and 2 mL reactions are prepared from addition of HIS-TGF-βR1 T204D or...
J Med Chem 51: 7243-52 (2008)
BindingDB Entry DOI: 10.7270/Q2B85BFB
TGF-betaR1 T204D
(Homo sapiens (Human))
BDBM282968
(6-(1-cyclobutyl-4-(4-fluorophenyl)-1H-imidazol-5- ...)
Show SMILES NC(=O)c1cnc2ccc(cn12)-c1c(ncn1C1CCC1)-c1ccc(F)cc1
Show InChI InChI=1S/C21H18FN5O/c22-15-7-4-13(5-8-15)19-20(27(12-25-19)16-2-1-3-16)14-6-9-18-24-10-17(21(23)28)26(18)11-14/h4-12,16H,1-3H2,(H2,23,28)
NCI pathway
Reactome pathway
US Patent
n/an/a 0.5n/an/an/an/an/an/a
University of Wisconsin at Madison
Assay Description
Assays for the compounds reported below were conducted in 1536-well plates and 2 mL reactions are prepared from addition of HIS-TGF-βR1 T204D or...
J Med Chem 51: 7243-52 (2008)
BindingDB Entry DOI: 10.7270/Q2B85BFB
TGF-beta receptor type II
(Homo sapiens (Human))
BDBM282968
(6-(1-cyclobutyl-4-(4-fluorophenyl)-1H-imidazol-5- ...)
Show SMILES NC(=O)c1cnc2ccc(cn12)-c1c(ncn1C1CCC1)-c1ccc(F)cc1
Show InChI InChI=1S/C21H18FN5O/c22-15-7-4-13(5-8-15)19-20(27(12-25-19)16-2-1-3-16)14-6-9-18-24-10-17(21(23)28)26(18)11-14/h4-12,16H,1-3H2,(H2,23,28)
NCI pathway
Reactome pathway
US Patent
n/an/a 1.74E+3n/an/an/an/an/an/a
Rigel Pharmaceuticals, Inc.; Bristol-Myers Squibb Company
US Patent
US Patent US9884868 (2018)
BindingDB Entry DOI: 10.7270/Q20P122M