BDBM282970 6-(1-(sec-butyl)-4-(4-fluorophenyl)-1H-imidazol-5- yl)imidazo[1,2-a]pyridine-3-carboxamide::US10287295, Example 174'::US9884868, Example 174'
SMILES: CCC(C)n1cnc(c1-c1ccc2ncc(C(N)=O)n2c1)-c1ccc(F)cc1
InChI Key: InChIKey=JIALVLIWDWZWDG-UHFFFAOYSA-N
Data: 4 IC50
Activity Spreadsheet -- Enzyme Inhibition Constant Data from BindingDB
Found 4 hits for monomerid = 282970
Trg + Lig
Ki
nM
ΔG°
kcal/mole
IC50
nM
Kd
nM
EC50/IC50
nM
koff
s-1
kon
M-1s-1
pHTemp
°C
TGF-beta receptor type-1
(Homo sapiens (Human))
BDBM282970
(6-(1-(sec-butyl)-4-(4-fluorophenyl)-1H-imidazol-5-...)
Show SMILES CCC(C)n1cnc(c1-c1ccc2ncc(C(N)=O)n2c1)-c1ccc(F)cc1
Show InChI InChI=1S/C21H20FN5O/c1-3-13(2)27-12-25-19(14-4-7-16(22)8-5-14)20(27)15-6-9-18-24-10-17(21(23)28)26(18)11-15/h4-13H,3H2,1-2H3,(H2,23,28)
US Patent
n/an/a 0.600n/an/an/an/a7.425
Rigel Pharmaceuticals, Inc.; Bristol-Myers Squibb Company
US Patent
Assay Description
Assays for the compounds reported below were conducted in 1536-well plates and 2 mL reactions are prepared from addition of HIS-TGF-βR1 T204D or...
US Patent US9884868 (2018)
BindingDB Entry DOI: 10.7270/Q20P122M
TGF-beta receptor type II
(Homo sapiens (Human))
BDBM282970
(6-(1-(sec-butyl)-4-(4-fluorophenyl)-1H-imidazol-5-...)
Show SMILES CCC(C)n1cnc(c1-c1ccc2ncc(C(N)=O)n2c1)-c1ccc(F)cc1
Show InChI InChI=1S/C21H20FN5O/c1-3-13(2)27-12-25-19(14-4-7-16(22)8-5-14)20(27)15-6-9-18-24-10-17(21(23)28)26(18)11-15/h4-13H,3H2,1-2H3,(H2,23,28)
NCI pathway
Reactome pathway
US Patent
n/an/a 5.55E+3n/an/an/an/an/an/a
University of Wisconsin at Madison
Assay Description
Assays for the compounds reported below were conducted in 1536-well plates and 2 mL reactions are prepared from addition of HIS-TGF-βR1 T204D or...
J Med Chem 51: 7243-52 (2008)
BindingDB Entry DOI: 10.7270/Q2B85BFB
TGF-betaR1 T204D
(Homo sapiens (Human))
BDBM282970
(6-(1-(sec-butyl)-4-(4-fluorophenyl)-1H-imidazol-5-...)
Show SMILES CCC(C)n1cnc(c1-c1ccc2ncc(C(N)=O)n2c1)-c1ccc(F)cc1
Show InChI InChI=1S/C21H20FN5O/c1-3-13(2)27-12-25-19(14-4-7-16(22)8-5-14)20(27)15-6-9-18-24-10-17(21(23)28)26(18)11-15/h4-13H,3H2,1-2H3,(H2,23,28)
NCI pathway
Reactome pathway
US Patent
n/an/a 0.600n/an/an/an/an/an/a
University of Wisconsin at Madison
Assay Description
Assays for the compounds reported below were conducted in 1536-well plates and 2 mL reactions are prepared from addition of HIS-TGF-βR1 T204D or...
J Med Chem 51: 7243-52 (2008)
BindingDB Entry DOI: 10.7270/Q2B85BFB
TGF-beta receptor type II
(Homo sapiens (Human))
BDBM282970
(6-(1-(sec-butyl)-4-(4-fluorophenyl)-1H-imidazol-5-...)
Show SMILES CCC(C)n1cnc(c1-c1ccc2ncc(C(N)=O)n2c1)-c1ccc(F)cc1
Show InChI InChI=1S/C21H20FN5O/c1-3-13(2)27-12-25-19(14-4-7-16(22)8-5-14)20(27)15-6-9-18-24-10-17(21(23)28)26(18)11-15/h4-13H,3H2,1-2H3,(H2,23,28)
NCI pathway
Reactome pathway
US Patent
n/an/a 5.55E+3n/an/an/an/an/an/a
Rigel Pharmaceuticals, Inc.; Bristol-Myers Squibb Company
US Patent
US Patent US9884868 (2018)
BindingDB Entry DOI: 10.7270/Q20P122M