BDBM283013 6-(1-(2,2-difluoroethyl)-4-(4-fluorophenyl)-1H- imidazol-5-yl)-3-(difluoromethyl) imidazo[1,2-b]pyridazine::US10287295, Example 215'::US9884868, Example 215'
SMILES: FC(F)Cn1cnc(c1-c1ccc2ncc(C(F)F)n2n1)-c1ccc(F)cc1
InChI Key: InChIKey=CUZYUXWEQICOBS-UHFFFAOYSA-N
Data: 4 IC50
Activity Spreadsheet -- Enzyme Inhibition Constant Data from BindingDB
Found 4 hits for monomerid = 283013
Trg + Lig
Ki
nM
ΔG°
kcal/mole
IC50
nM
Kd
nM
EC50/IC50
nM
koff
s-1
kon
M-1s-1
pHTemp
°C
TGF-beta receptor type-1
(Homo sapiens (Human))
BDBM283013
(6-(1-(2,2-difluoroethyl)-4-(4-fluorophenyl)-1H- im...)
Show SMILES FC(F)Cn1cnc(c1-c1ccc2ncc(C(F)F)n2n1)-c1ccc(F)cc1
Show InChI InChI=1S/C18H12F5N5/c19-11-3-1-10(2-4-11)16-17(27(9-25-16)8-14(20)21)12-5-6-15-24-7-13(18(22)23)28(15)26-12/h1-7,9,14,18H,8H2
US Patent
n/an/a 0.800n/an/an/an/a7.425
Rigel Pharmaceuticals, Inc.; Bristol-Myers Squibb Company
US Patent
Assay Description
Assays for the compounds reported below were conducted in 1536-well plates and 2 mL reactions are prepared from addition of HIS-TGF-βR1 T204D or...
US Patent US9884868 (2018)
BindingDB Entry DOI: 10.7270/Q20P122M
TGF-beta receptor type II
(Homo sapiens (Human))
BDBM283013
(6-(1-(2,2-difluoroethyl)-4-(4-fluorophenyl)-1H- im...)
Show SMILES FC(F)Cn1cnc(c1-c1ccc2ncc(C(F)F)n2n1)-c1ccc(F)cc1
Show InChI InChI=1S/C18H12F5N5/c19-11-3-1-10(2-4-11)16-17(27(9-25-16)8-14(20)21)12-5-6-15-24-7-13(18(22)23)28(15)26-12/h1-7,9,14,18H,8H2
NCI pathway
Reactome pathway
US Patent
n/an/a 7.20E+3n/an/an/an/an/an/a
University of Wisconsin at Madison
Assay Description
Assays for the compounds reported below were conducted in 1536-well plates and 2 mL reactions are prepared from addition of HIS-TGF-βR1 T204D or...
J Med Chem 51: 7243-52 (2008)
BindingDB Entry DOI: 10.7270/Q2B85BFB
TGF-betaR1 T204D
(Homo sapiens (Human))
BDBM283013
(6-(1-(2,2-difluoroethyl)-4-(4-fluorophenyl)-1H- im...)
Show SMILES FC(F)Cn1cnc(c1-c1ccc2ncc(C(F)F)n2n1)-c1ccc(F)cc1
Show InChI InChI=1S/C18H12F5N5/c19-11-3-1-10(2-4-11)16-17(27(9-25-16)8-14(20)21)12-5-6-15-24-7-13(18(22)23)28(15)26-12/h1-7,9,14,18H,8H2
NCI pathway
Reactome pathway
US Patent
n/an/a 0.800n/an/an/an/an/an/a
University of Wisconsin at Madison
Assay Description
Assays for the compounds reported below were conducted in 1536-well plates and 2 mL reactions are prepared from addition of HIS-TGF-βR1 T204D or...
J Med Chem 51: 7243-52 (2008)
BindingDB Entry DOI: 10.7270/Q2B85BFB
TGF-beta receptor type II
(Homo sapiens (Human))
BDBM283013
(6-(1-(2,2-difluoroethyl)-4-(4-fluorophenyl)-1H- im...)
Show SMILES FC(F)Cn1cnc(c1-c1ccc2ncc(C(F)F)n2n1)-c1ccc(F)cc1
Show InChI InChI=1S/C18H12F5N5/c19-11-3-1-10(2-4-11)16-17(27(9-25-16)8-14(20)21)12-5-6-15-24-7-13(18(22)23)28(15)26-12/h1-7,9,14,18H,8H2
NCI pathway
Reactome pathway
US Patent
n/an/a 7.20E+3n/an/an/an/an/an/a
Rigel Pharmaceuticals, Inc.; Bristol-Myers Squibb Company
US Patent
US Patent US9884868 (2018)
BindingDB Entry DOI: 10.7270/Q20P122M