BDBM283235 4-{2-(4-aminopiperidyl)-1-methyl- 6-oxo-5-[6-(trifluoromethyl) (3- pyridyl)]hydropyrimidin-4-yl}- 2-fluorobenzenecarbonitrile::US10023543, Example 23::US10207999, Example 23::US10328077, Example 23::US10548896, Example 23::US10849898, Example 23::US10960005, Example 23::US9573930, Example 23::US9771329, Example 23::US9776974, Example 23
SMILES: Cn1c(nc(-c2ccc(C#N)c(F)c2)c(-c2ccc(nc2)C(F)(F)F)c1=O)N1CCC(N)CC1
InChI Key: InChIKey=ACMNUSISKUJCSP-UHFFFAOYSA-N
Data: 11 IC50
Activity Spreadsheet -- Enzyme Inhibition Constant Data from BindingDB
Found 12 hits for monomerid = 283235
Trg + Lig
Ki
nM
ΔG°
kcal/mole
IC50
nM
Kd
nM
EC50/IC50
nM
koff
s-1
kon
M-1s-1
pHTemp
°C
Lysine-specific histone demethylase 1A
(Homo sapiens (Human))
BDBM283235
(4-{2-(4-aminopiperidyl)-1-methyl- 6-oxo-5-[6-(trif...)
Show SMILES Cn1c(nc(-c2ccc(C#N)c(F)c2)c(-c2ccc(nc2)C(F)(F)F)c1=O)N1CCC(N)CC1
Show InChI InChI=1S/C23H20F4N6O/c1-32-21(34)19(15-4-5-18(30-12-15)23(25,26)27)20(13-2-3-14(11-28)17(24)10-13)31-22(32)33-8-6-16(29)7-9-33/h2-5,10,12,16H,6-9,29H2,1H3
Reactome pathway
US Patent
n/an/a<100n/an/an/an/an/a25
CELGENE QUANTICEL RESEARCH, INC.
US Patent
Assay Description
This assay determines the ability of a test compound to inhibit LSD1 demethylase activity. E. coli expressed full-length human LSD1 (Accession number...
US Patent US10023543 (2018)
BindingDB Entry DOI: 10.7270/Q2GQ70TM
Lysine-specific histone demethylase 1A
(Homo sapiens (Human))
BDBM283235
(4-{2-(4-aminopiperidyl)-1-methyl- 6-oxo-5-[6-(trif...)
Show SMILES Cn1c(nc(-c2ccc(C#N)c(F)c2)c(-c2ccc(nc2)C(F)(F)F)c1=O)N1CCC(N)CC1
Show InChI InChI=1S/C23H20F4N6O/c1-32-21(34)19(15-4-5-18(30-12-15)23(25,26)27)20(13-2-3-14(11-28)17(24)10-13)31-22(32)33-8-6-16(29)7-9-33/h2-5,10,12,16H,6-9,29H2,1H3
Reactome pathway
US Patent
n/an/a<100n/an/an/an/an/a25
Celgene Quanticel Research, Inc.
US Patent
Assay Description
This assay determines the ability of a test compound to inhibit LSD1 demethylase activity. E. coli expressed full-length human LSD1 (Accession number...
US Patent US9573930 (2017)
BindingDB Entry DOI: 10.7270/Q2H70HV3
Lysine-specific histone demethylase 1A
(Homo sapiens (Human))
BDBM283235
(4-{2-(4-aminopiperidyl)-1-methyl- 6-oxo-5-[6-(trif...)
Show SMILES Cn1c(nc(-c2ccc(C#N)c(F)c2)c(-c2ccc(nc2)C(F)(F)F)c1=O)N1CCC(N)CC1
Show InChI InChI=1S/C23H20F4N6O/c1-32-21(34)19(15-4-5-18(30-12-15)23(25,26)27)20(13-2-3-14(11-28)17(24)10-13)31-22(32)33-8-6-16(29)7-9-33/h2-5,10,12,16H,6-9,29H2,1H3
Reactome pathway
US Patent
n/an/a<100n/an/an/an/an/an/a
Celgene Quanticel Research, Inc.
US Patent
Assay Description
The enzymatic assay of LSD1 activity is based on Time Resolved-Fluorescence Resonance Energy Transfer (TR-FRET) detection. The inhibitory properties ...
US Patent US9776974 (2017)
BindingDB Entry DOI: 10.7270/Q2BZ686N
Lysine-specific histone demethylase 1A
(Homo sapiens (Human))
BDBM283235
(4-{2-(4-aminopiperidyl)-1-methyl- 6-oxo-5-[6-(trif...)
Show SMILES Cn1c(nc(-c2ccc(C#N)c(F)c2)c(-c2ccc(nc2)C(F)(F)F)c1=O)N1CCC(N)CC1
Show InChI InChI=1S/C23H20F4N6O/c1-32-21(34)19(15-4-5-18(30-12-15)23(25,26)27)20(13-2-3-14(11-28)17(24)10-13)31-22(32)33-8-6-16(29)7-9-33/h2-5,10,12,16H,6-9,29H2,1H3
Reactome pathway
US Patent
n/an/a<100n/an/an/an/an/an/a
Celgene Quanticel Research, Inc.
US Patent
Assay Description
The enzymatic assay of LSD1 activity is based on Time Resolved-Fluorescence Resonance Energy Transfer (TR-FRET) detection. The inhibitory properties ...
US Patent US9771329 (2017)
BindingDB Entry DOI: 10.7270/Q2NG4SR7
Lysine-specific histone demethylase 1A
(Homo sapiens (Human))
BDBM283235
(4-{2-(4-aminopiperidyl)-1-methyl- 6-oxo-5-[6-(trif...)
Show SMILES Cn1c(nc(-c2ccc(C#N)c(F)c2)c(-c2ccc(nc2)C(F)(F)F)c1=O)N1CCC(N)CC1
Show InChI InChI=1S/C23H20F4N6O/c1-32-21(34)19(15-4-5-18(30-12-15)23(25,26)27)20(13-2-3-14(11-28)17(24)10-13)31-22(32)33-8-6-16(29)7-9-33/h2-5,10,12,16H,6-9,29H2,1H3
Reactome pathway
US Patent
n/an/a<100n/an/an/an/an/an/a
Duquesne University
Assay Description
This assay determines the ability of a test compound to inhibit LSD-1 demethylase activity. E. coli expressed full-length human LSD-1 (Accession numb...
Bioorg Med Chem 17: 7324-36 (2009)
BindingDB Entry DOI: 10.7270/Q2W66P3N
Lysine-specific histone demethylase 1A
(Homo sapiens (Human))
BDBM283235
(4-{2-(4-aminopiperidyl)-1-methyl- 6-oxo-5-[6-(trif...)
Show SMILES Cn1c(nc(-c2ccc(C#N)c(F)c2)c(-c2ccc(nc2)C(F)(F)F)c1=O)N1CCC(N)CC1
Show InChI InChI=1S/C23H20F4N6O/c1-32-21(34)19(15-4-5-18(30-12-15)23(25,26)27)20(13-2-3-14(11-28)17(24)10-13)31-22(32)33-8-6-16(29)7-9-33/h2-5,10,12,16H,6-9,29H2,1H3
Reactome pathway
n/an/a<100n/an/an/an/an/an/a
TBA
Citation and Details
Lysine-specific histone demethylase 1A
(Homo sapiens (Human))
BDBM283235
(4-{2-(4-aminopiperidyl)-1-methyl- 6-oxo-5-[6-(trif...)
Show SMILES Cn1c(nc(-c2ccc(C#N)c(F)c2)c(-c2ccc(nc2)C(F)(F)F)c1=O)N1CCC(N)CC1
Show InChI InChI=1S/C23H20F4N6O/c1-32-21(34)19(15-4-5-18(30-12-15)23(25,26)27)20(13-2-3-14(11-28)17(24)10-13)31-22(32)33-8-6-16(29)7-9-33/h2-5,10,12,16H,6-9,29H2,1H3
Reactome pathway
US Patent
n/an/a<100n/an/an/an/an/an/a
CELGENE QUANTICEL RESEARCH, INC.
US Patent
Assay Description
To analyze LSD1 inhibitor efficacy in cells, a CD11b flow cytometry assay was performed. LSD1 inhibition induces CD11b expression in THP-1 (AML) cell...
US Patent US10207999 (2019)
BindingDB Entry DOI: 10.7270/Q2DJ5HRT
Lysine-specific histone demethylase 1A
(Homo sapiens (Human))
BDBM283235
(4-{2-(4-aminopiperidyl)-1-methyl- 6-oxo-5-[6-(trif...)
Show SMILES Cn1c(nc(-c2ccc(C#N)c(F)c2)c(-c2ccc(nc2)C(F)(F)F)c1=O)N1CCC(N)CC1
Show InChI InChI=1S/C23H20F4N6O/c1-32-21(34)19(15-4-5-18(30-12-15)23(25,26)27)20(13-2-3-14(11-28)17(24)10-13)31-22(32)33-8-6-16(29)7-9-33/h2-5,10,12,16H,6-9,29H2,1H3
Reactome pathway
US Patent
n/an/a<100n/an/an/an/an/an/a
Celgene Quanticel Research, Inc.
US Patent
Assay Description
This assay determines the ability of a test compound to inhibit LSD-1 demethylase activity. E. coli expressed full-length human LSD-1 (Accession numb...
US Patent US10543213 (2020)
BindingDB Entry DOI: 10.7270/Q2X63QBC
Lysine-specific histone demethylase 1A
(Homo sapiens (Human))
BDBM283235
(4-{2-(4-aminopiperidyl)-1-methyl- 6-oxo-5-[6-(trif...)
Show SMILES Cn1c(nc(-c2ccc(C#N)c(F)c2)c(-c2ccc(nc2)C(F)(F)F)c1=O)N1CCC(N)CC1
Show InChI InChI=1S/C23H20F4N6O/c1-32-21(34)19(15-4-5-18(30-12-15)23(25,26)27)20(13-2-3-14(11-28)17(24)10-13)31-22(32)33-8-6-16(29)7-9-33/h2-5,10,12,16H,6-9,29H2,1H3
Reactome pathway
US Patent
n/an/a<100n/an/an/an/an/an/a
Celgene Quanticel Research, Inc.
US Patent
Assay Description
This assay determines the ability of a test compound to inhibit LSD-1 demethylase activity. E. coli expressed full-length human LSD-1 (Accession numb...
US Patent US10548896 (2020)
BindingDB Entry DOI: 10.7270/Q29889CV
Lysine-specific histone demethylase 1A
(Homo sapiens (Human))
BDBM283235
(4-{2-(4-aminopiperidyl)-1-methyl- 6-oxo-5-[6-(trif...)
Show SMILES Cn1c(nc(-c2ccc(C#N)c(F)c2)c(-c2ccc(nc2)C(F)(F)F)c1=O)N1CCC(N)CC1
Show InChI InChI=1S/C23H20F4N6O/c1-32-21(34)19(15-4-5-18(30-12-15)23(25,26)27)20(13-2-3-14(11-28)17(24)10-13)31-22(32)33-8-6-16(29)7-9-33/h2-5,10,12,16H,6-9,29H2,1H3
Reactome pathway
US Patent
n/an/a<100n/an/an/an/an/an/a
CELGENE QUANTICEL RESEARCH, INC.
US Patent
Assay Description
This assay determines the ability of a test compound to inhibit LSD-1 demethylase activity. E. coli expressed full-length human LSD-1 (Accession numb...
US Patent US10849898 (2020)
Lysine-specific histone demethylase 1A
(Homo sapiens (Human))
BDBM283235
(4-{2-(4-aminopiperidyl)-1-methyl- 6-oxo-5-[6-(trif...)
Show SMILES Cn1c(nc(-c2ccc(C#N)c(F)c2)c(-c2ccc(nc2)C(F)(F)F)c1=O)N1CCC(N)CC1
Show InChI InChI=1S/C23H20F4N6O/c1-32-21(34)19(15-4-5-18(30-12-15)23(25,26)27)20(13-2-3-14(11-28)17(24)10-13)31-22(32)33-8-6-16(29)7-9-33/h2-5,10,12,16H,6-9,29H2,1H3
Reactome pathway
US Patent
n/an/a<100n/an/an/an/an/an/a
CELGENE QUANTICEL RESEARCH, INC.
US Patent
Assay Description
The enzymatic assay of LSD-1 activity is based on Tnne Resolved-Fluorescence Resonance Energy Transfer (TR-FRET) detection. The inhibitory properties...
US Patent US10960005 (2021)
Lysine-specific histone demethylase 1A
(Homo sapiens (Human))
BDBM283235
(4-{2-(4-aminopiperidyl)-1-methyl- 6-oxo-5-[6-(trif...)
Show SMILES Cn1c(nc(-c2ccc(C#N)c(F)c2)c(-c2ccc(nc2)C(F)(F)F)c1=O)N1CCC(N)CC1
Show InChI InChI=1S/C23H20F4N6O/c1-32-21(34)19(15-4-5-18(30-12-15)23(25,26)27)20(13-2-3-14(11-28)17(24)10-13)31-22(32)33-8-6-16(29)7-9-33/h2-5,10,12,16H,6-9,29H2,1H3
Reactome pathway
US Patent
n/an/a<100n/an/an/an/an/an/a
CELGENE QUANTICEL RESEARCH, INC.
US Patent
Assay Description
This assay determines the ability of a test compound to inhibit LSD1 demethylase activity. E. coli expressed full-length human LSD1 (Accession number...
US Patent US10207999 (2019)
BindingDB Entry DOI: 10.7270/Q2DJ5HRT