BDBM283462 N-((6-amino-2,4-dimethylpyridin-3-yl)methyl)- 2-((6-methylquinolin-3- yl)methyl)isonicotinamide::US10023557, Example 114::US10266515, Example 114::US10308637, Example 114::US9611252, Example 114
SMILES: Cc1ccc2ncc(Cc3cc(ccn3)C(=O)NCc3c(C)cc(N)nc3C)cc2c1
InChI Key: InChIKey=PERODSYFHIKGOQ-UHFFFAOYSA-N
Data: 5 IC50  3 EC50
Activity Spreadsheet -- Enzyme Inhibition Constant Data from BindingDB
Found 8 hits for monomerid = 283462
Trg + Lig
Ki
nM
ΔG°
kcal/mole
IC50
nM
Kd
nM
EC50/IC50
nM
koff
s-1
kon
M-1s-1
pHTemp
°C
Plasma kallikrein
(Homo sapiens (Human))
BDBM283462
(N-((6-amino-2,4-dimethylpyridin-3-yl)methyl)- 2-((...)
Show SMILES Cc1ccc2ncc(Cc3cc(ccn3)C(=O)NCc3c(C)cc(N)nc3C)cc2c1
Show InChI InChI=1S/C25H25N5O/c1-15-4-5-23-20(8-15)10-18(13-28-23)11-21-12-19(6-7-27-21)25(31)29-14-22-16(2)9-24(26)30-17(22)3/h4-10,12-13H,11,14H2,1-3H3,(H2,26,30)(H,29,31)
US Patent
n/an/a<100n/an/an/an/a7.5n/a
LIFESCI PHARMACEUTICALS, INC.
US Patent
Assay Description
A 10 mM solution of the test compound was made in DMSO. This solution was serially diluted 1:5 in DMSO to yield 2000, 400, 80, 16, 3.2, 0.64, 0.128, ...
US Patent US10023557 (2018)
BindingDB Entry DOI: 10.7270/Q2BZ6839
Plasma kallikrein
(Homo sapiens (Human))
BDBM283462
(N-((6-amino-2,4-dimethylpyridin-3-yl)methyl)- 2-((...)
Show SMILES Cc1ccc2ncc(Cc3cc(ccn3)C(=O)NCc3c(C)cc(N)nc3C)cc2c1
Show InChI InChI=1S/C25H25N5O/c1-15-4-5-23-20(8-15)10-18(13-28-23)11-21-12-19(6-7-27-21)25(31)29-14-22-16(2)9-24(26)30-17(22)3/h4-10,12-13H,11,14H2,1-3H3,(H2,26,30)(H,29,31)
US Patent
n/an/an/an/a<100n/an/an/an/a
LIFESCI PHARMACEUTICALS, INC.
US Patent
Assay Description
The test compounds at various concentrations, also prepared by serial dilutions as described above, are added to the test wells. The volume of test c...
US Patent US10023557 (2018)
BindingDB Entry DOI: 10.7270/Q2BZ6839
Plasma kallikrein
(Homo sapiens (Human))
BDBM283462
(N-((6-amino-2,4-dimethylpyridin-3-yl)methyl)- 2-((...)
Show SMILES Cc1ccc2ncc(Cc3cc(ccn3)C(=O)NCc3c(C)cc(N)nc3C)cc2c1
Show InChI InChI=1S/C25H25N5O/c1-15-4-5-23-20(8-15)10-18(13-28-23)11-21-12-19(6-7-27-21)25(31)29-14-22-16(2)9-24(26)30-17(22)3/h4-10,12-13H,11,14H2,1-3H3,(H2,26,30)(H,29,31)
US Patent
n/an/a<100n/an/an/an/an/an/a
LIFESCI PHARMACEUTICALS, INC.
US Patent
Assay Description
The ability of the compounds disclosed herein to inhibit human plasma kallikrein activity was quantified according to the procedures below.A 10 mM so...
US Patent US9611252 (2017)
BindingDB Entry DOI: 10.7270/Q2930W8S
Plasma kallikrein
(Homo sapiens (Human))
BDBM283462
(N-((6-amino-2,4-dimethylpyridin-3-yl)methyl)- 2-((...)
Show SMILES Cc1ccc2ncc(Cc3cc(ccn3)C(=O)NCc3c(C)cc(N)nc3C)cc2c1
Show InChI InChI=1S/C25H25N5O/c1-15-4-5-23-20(8-15)10-18(13-28-23)11-21-12-19(6-7-27-21)25(31)29-14-22-16(2)9-24(26)30-17(22)3/h4-10,12-13H,11,14H2,1-3H3,(H2,26,30)(H,29,31)
US Patent
n/an/an/an/a<100n/an/an/an/a
ATTUNE PHARMACEUTICALS, INC.
US Patent
Assay Description
Materials:Plasma kallikrein inhibitor C1NH (Athens Research & Technology, Cat #16-16-031509); Ellagic acid (Sigma, E2250); Substrate Z-FR-2-AMC (GL B...
US Patent US11021463 (2021)
Plasma kallikrein
(Homo sapiens (Human))
BDBM283462
(N-((6-amino-2,4-dimethylpyridin-3-yl)methyl)- 2-((...)
Show SMILES Cc1ccc2ncc(Cc3cc(ccn3)C(=O)NCc3c(C)cc(N)nc3C)cc2c1
Show InChI InChI=1S/C25H25N5O/c1-15-4-5-23-20(8-15)10-18(13-28-23)11-21-12-19(6-7-27-21)25(31)29-14-22-16(2)9-24(26)30-17(22)3/h4-10,12-13H,11,14H2,1-3H3,(H2,26,30)(H,29,31)
US Patent
n/an/a<100n/an/an/an/an/an/a
ENSCMu
Assay Description
A 10 mM solution of the test compound was made in DMSO. This solution was serially diluted 1:5 in DMSO to yield 2000, 400, 80, 16, 3.2, 0.64, 0.128, ...
Bioorg Med Chem 14: 7241-57 (2006)
BindingDB Entry DOI: 10.7270/Q2J968P7
Plasma kallikrein
(Homo sapiens (Human))
BDBM283462
(N-((6-amino-2,4-dimethylpyridin-3-yl)methyl)- 2-((...)
Show SMILES Cc1ccc2ncc(Cc3cc(ccn3)C(=O)NCc3c(C)cc(N)nc3C)cc2c1
Show InChI InChI=1S/C25H25N5O/c1-15-4-5-23-20(8-15)10-18(13-28-23)11-21-12-19(6-7-27-21)25(31)29-14-22-16(2)9-24(26)30-17(22)3/h4-10,12-13H,11,14H2,1-3H3,(H2,26,30)(H,29,31)
US Patent
n/an/an/an/a<100n/an/an/an/a
ENSCMu
Assay Description
Human plasma is thawed on ice and centrifuged for 15 min at 4° C. to remove platelets. A 1 mM stock solution of ellagic acid is diluted to 8 μM ...
Bioorg Med Chem 14: 7241-57 (2006)
BindingDB Entry DOI: 10.7270/Q2J968P7
Plasma kallikrein
(Homo sapiens (Human))
BDBM283462
(N-((6-amino-2,4-dimethylpyridin-3-yl)methyl)- 2-((...)
Show SMILES Cc1ccc2ncc(Cc3cc(ccn3)C(=O)NCc3c(C)cc(N)nc3C)cc2c1
Show InChI InChI=1S/C25H25N5O/c1-15-4-5-23-20(8-15)10-18(13-28-23)11-21-12-19(6-7-27-21)25(31)29-14-22-16(2)9-24(26)30-17(22)3/h4-10,12-13H,11,14H2,1-3H3,(H2,26,30)(H,29,31)
US Patent
n/an/a<100n/an/an/an/an/an/a
ATTUNE PHARMACEUTICALS, INC.
US Patent
Assay Description
A 10 mM solution of the test compound was made in DMSO. This solution was serially diluted 1:5 in DMSO to yield 2000, 400, 80, 16, 3.2, 0.64, 0.128, ...
US Patent US11021463 (2021)
Mitogen-activated protein kinase kinase kinase kinase 1
(Homo sapiens (Human))
BDBM283462
(N-((6-amino-2,4-dimethylpyridin-3-yl)methyl)- 2-((...)
Show SMILES Cc1ccc2ncc(Cc3cc(ccn3)C(=O)NCc3c(C)cc(N)nc3C)cc2c1
Show InChI InChI=1S/C25H25N5O/c1-15-4-5-23-20(8-15)10-18(13-28-23)11-21-12-19(6-7-27-21)25(31)29-14-22-16(2)9-24(26)30-17(22)3/h4-10,12-13H,11,14H2,1-3H3,(H2,26,30)(H,29,31)
NCI pathway
US Patent
n/an/a<100n/an/an/an/an/an/a
Vitae Pharmaceuticals
Assay Description
A 10 mM solution of the test compound was made in DMSO. This solution was serially diluted 1:5 in DMSO to yield 2000, 400, 80, 16, 3.2, 0.64, 0.128, ...
Bioorg Med Chem Lett 19: 3541-5 (2009)
BindingDB Entry DOI: 10.7270/Q25141K2