BDBM283993 E19::US10023564, Example 19
SMILES: CCC(C)N(C)C(=O)c1cc(ccc1F)C1NC(=O)NC(C)=C1C(=O)Nc1ccc2[nH]ncc2c1
InChI Key:
Data: 6 IC50
Activity Spreadsheet -- Enzyme Inhibition Constant Data from BindingDB
Found 6 hits for monomerid = 283993
Trg + Lig
Ki
nM
ΔG°
kcal/mole
IC50
nM
Kd
nM
EC50/IC50
nM
koff
s-1
kon
M-1s-1
pHTemp
°C
Rhodopsin kinase GRK1
(Homo sapiens (Human))
BDBM283993
(E19 | US10023564, Example 19)
Show SMILES CCC(C)N(C)C(=O)c1cc(ccc1F)C1NC(=O)NC(C)=C1C(=O)Nc1ccc2[nH]ncc2c1 |c:22|
NCI pathway
Reactome pathway
US Patent
n/an/a>1.00E+5n/an/an/an/a7.0n/a
THE REGENTS OF THE UNIVERSITY OF MICHIGAN
US Patent
Assay Description
GRK1, 2 and 5 kinetic assays were conducted in a buffer containing 20 mM HEPES pH 7.0, 5 μM ATP, 2 mM MgCl2, and 0.025% DDM with 50 nM GRK and e...
US Patent US10023564 (2018)
BindingDB Entry DOI: 10.7270/Q2V126V5
Beta-adrenergic receptor kinase 1
(Homo sapiens (Human))
BDBM283993
(E19 | US10023564, Example 19)
Show SMILES CCC(C)N(C)C(=O)c1cc(ccc1F)C1NC(=O)NC(C)=C1C(=O)Nc1ccc2[nH]ncc2c1 |c:22|
Reactome pathway
US Patent
n/an/a 5.10E+4n/an/an/an/a7.0n/a
THE REGENTS OF THE UNIVERSITY OF MICHIGAN
US Patent
Assay Description
GRK1, 2 and 5 kinetic assays were conducted in a buffer containing 20 mM HEPES pH 7.0, 5 μM ATP, 2 mM MgCl2, and 0.025% DDM with 50 nM GRK and e...
US Patent US10023564 (2018)
BindingDB Entry DOI: 10.7270/Q2V126V5
G protein-coupled receptor kinase 5
(Homo sapiens (Human))
BDBM283993
(E19 | US10023564, Example 19)
Show SMILES CCC(C)N(C)C(=O)c1cc(ccc1F)C1NC(=O)NC(C)=C1C(=O)Nc1ccc2[nH]ncc2c1 |c:22|
NCI pathway
Reactome pathway
n/an/a>1.00E+5n/an/an/an/an/an/a
University of Michigan
Curated by ChEMBL
Assay Description
Inhibition of GRK5 (unknown origin) preincubated for 10 mins followed by peptide substrate and ATP addition measured after 1 hr by TR-FRET assay
Bioorg Med Chem Lett 28: 1507-1515 (2018)
Article DOI: 10.1016/j.bmcl.2018.03.082
BindingDB Entry DOI: 10.7270/Q22Z1868
Rhodopsin kinase GRK1
(Homo sapiens (Human))
BDBM283993
(E19 | US10023564, Example 19)
Show SMILES CCC(C)N(C)C(=O)c1cc(ccc1F)C1NC(=O)NC(C)=C1C(=O)Nc1ccc2[nH]ncc2c1 |c:22|
NCI pathway
Reactome pathway
n/an/a>1.00E+5n/an/an/an/an/an/a
University of Michigan
Curated by ChEMBL
Assay Description
Inhibition of GRK1 (unknown origin) preincubated for 10 mins followed by peptide substrate and ATP addition measured after 1 hr by TR-FRET assay
Bioorg Med Chem Lett 28: 1507-1515 (2018)
Article DOI: 10.1016/j.bmcl.2018.03.082
BindingDB Entry DOI: 10.7270/Q22Z1868
Beta-adrenergic receptor kinase 1
(Homo sapiens (Human))
BDBM283993
(E19 | US10023564, Example 19)
Show SMILES CCC(C)N(C)C(=O)c1cc(ccc1F)C1NC(=O)NC(C)=C1C(=O)Nc1ccc2[nH]ncc2c1 |c:22|
Reactome pathway
n/an/a 4.40E+4n/an/an/an/an/an/a
University of Michigan
Curated by ChEMBL
Assay Description
Inhibition of GRK2 (unknown origin) preincubated for 10 mins followed by peptide substrate and ATP addition measured after 1 hr by TR-FRET assay
Bioorg Med Chem Lett 28: 1507-1515 (2018)
Article DOI: 10.1016/j.bmcl.2018.03.082
BindingDB Entry DOI: 10.7270/Q22Z1868
G protein-coupled receptor kinase 5
(Homo sapiens (Human))
BDBM283993
(E19 | US10023564, Example 19)
Show SMILES CCC(C)N(C)C(=O)c1cc(ccc1F)C1NC(=O)NC(C)=C1C(=O)Nc1ccc2[nH]ncc2c1 |c:22|
NCI pathway
Reactome pathway
US Patent
n/an/a>1.00E+5n/an/an/an/a7.0n/a
THE REGENTS OF THE UNIVERSITY OF MICHIGAN
US Patent
Assay Description
GRK1, 2 and 5 kinetic assays were conducted in a buffer containing 20 mM HEPES pH 7.0, 5 μM ATP, 2 mM MgCl2, and 0.025% DDM with 50 nM GRK and e...
US Patent US10023564 (2018)
BindingDB Entry DOI: 10.7270/Q2V126V5