BDBM28517 (3R,5S)-5-{2-[4-({3-chloro-4-[(3-fluorophenyl)methoxy]phenyl}amino)thieno[3,2-d]pyrimidin-6-yl]ethynyl}pyrrolidin-3-yl pyrrolidine-1-carboxylate::pyrrolidinyl-acetylenic thieno[3,2-d]pyrimidine, 6g
SMILES: Fc1cccc(COc2ccc(Nc3ncnc4cc(sc34)C#C[C@@H]3C[C@H](CN3)OC(=O)N3CCCC3)cc2Cl)c1
InChI Key: InChIKey=UWADRORTXGMUIP-FYYLOGMGSA-N
Data: 2 IC50
Activity Spreadsheet -- Enzyme Inhibition Constant Data from BindingDB
Found 2 hits for monomerid = 28517
Trg + Lig
Ki
nM
ΔG°
kcal/mole
IC50
nM
Kd
nM
EC50/IC50
nM
koff
s-1
kon
M-1s-1
pHTemp
°C
Receptor tyrosine-protein kinase erbB-2
(Homo sapiens (Human))
BDBM28517
((3R,5S)-5-{2-[4-({3-chloro-4-[(3-fluorophenyl)meth...)
Show SMILES Fc1cccc(COc2ccc(Nc3ncnc4cc(sc34)C#C[C@@H]3C[C@H](CN3)OC(=O)N3CCCC3)cc2Cl)c1 |r|
Show InChI InChI=1S/C30H27ClFN5O3S/c31-25-14-22(7-9-27(25)39-17-19-4-3-5-20(32)12-19)36-29-28-26(34-18-35-29)15-24(41-28)8-6-21-13-23(16-33-21)40-30(38)37-10-1-2-11-37/h3-5,7,9,12,14-15,18,21,23,33H,1-2,10-11,13,16-17H2,(H,34,35,36)/t21-,23-/m1/s1
n/an/a 32n/an/an/an/an/an/a
GSK
Assay Description
Assays were performed in 96-well polystyrene round-bottomed plates in reaction buffer containing biotinylated substrate and purified kinase in the pr...
Bioorg Med Chem Lett 19: 21-6 (2009)
Article DOI: 10.1016/j.bmcl.2008.11.023
BindingDB Entry DOI: 10.7270/Q2NV9GKZ
Epidermal growth factor receptor
(Homo sapiens (Human))
BDBM28517
((3R,5S)-5-{2-[4-({3-chloro-4-[(3-fluorophenyl)meth...)
Show SMILES Fc1cccc(COc2ccc(Nc3ncnc4cc(sc34)C#C[C@@H]3C[C@H](CN3)OC(=O)N3CCCC3)cc2Cl)c1 |r|
Show InChI InChI=1S/C30H27ClFN5O3S/c31-25-14-22(7-9-27(25)39-17-19-4-3-5-20(32)12-19)36-29-28-26(34-18-35-29)15-24(41-28)8-6-21-13-23(16-33-21)40-30(38)37-10-1-2-11-37/h3-5,7,9,12,14-15,18,21,23,33H,1-2,10-11,13,16-17H2,(H,34,35,36)/t21-,23-/m1/s1
n/an/a 99n/an/an/an/a7.523
GSK
Assay Description
Assays were performed in 96-well polystyrene round-bottomed plates in reaction buffer containing biotinylated substrate and purified kinase in the pr...
Bioorg Med Chem Lett 19: 21-6 (2009)
Article DOI: 10.1016/j.bmcl.2008.11.023
BindingDB Entry DOI: 10.7270/Q2NV9GKZ