BDBM28525 (3S,5S)-5-{2-[4-({3-chloro-4-[(3-fluorophenyl)methoxy]phenyl}amino)thieno[3,2-d]pyrimidin-6-yl]ethynyl}pyrrolidin-3-yl morpholine-4-carboxylate::pyrrolidinyl-acetylenic thieno[3,2-d]pyrimidine, 19
SMILES: Fc1cccc(COc2ccc(Nc3ncnc4cc(sc34)C#C[C@@H]3C[C@@H](CN3)OC(=O)N3CCOCC3)cc2Cl)c1
InChI Key: InChIKey=NKOJMDRKLJSOJR-GGAORHGYSA-N
Data: 2 IC50
Activity Spreadsheet -- Enzyme Inhibition Constant Data from BindingDB
Found 2 hits for monomerid = 28525
Trg + Lig
Ki
nM
ΔG°
kcal/mole
IC50
nM
Kd
nM
EC50/IC50
nM
koff
s-1
kon
M-1s-1
pHTemp
°C
Receptor tyrosine-protein kinase erbB-2
(Homo sapiens (Human))
BDBM28525
((3S,5S)-5-{2-[4-({3-chloro-4-[(3-fluorophenyl)meth...)
Show SMILES Fc1cccc(COc2ccc(Nc3ncnc4cc(sc34)C#C[C@@H]3C[C@@H](CN3)OC(=O)N3CCOCC3)cc2Cl)c1 |r|
Show InChI InChI=1S/C30H27ClFN5O4S/c31-25-14-22(5-7-27(25)40-17-19-2-1-3-20(32)12-19)36-29-28-26(34-18-35-29)15-24(42-28)6-4-21-13-23(16-33-21)41-30(38)37-8-10-39-11-9-37/h1-3,5,7,12,14-15,18,21,23,33H,8-11,13,16-17H2,(H,34,35,36)/t21-,23+/m1/s1
n/an/a 40n/an/an/an/an/an/a
GSK
Assay Description
Assays were performed in 96-well polystyrene round-bottomed plates in reaction buffer containing biotinylated substrate and purified kinase in the pr...
Bioorg Med Chem Lett 19: 21-6 (2009)
Article DOI: 10.1016/j.bmcl.2008.11.023
BindingDB Entry DOI: 10.7270/Q2NV9GKZ
Epidermal growth factor receptor
(Homo sapiens (Human))
BDBM28525
((3S,5S)-5-{2-[4-({3-chloro-4-[(3-fluorophenyl)meth...)
Show SMILES Fc1cccc(COc2ccc(Nc3ncnc4cc(sc34)C#C[C@@H]3C[C@@H](CN3)OC(=O)N3CCOCC3)cc2Cl)c1 |r|
Show InChI InChI=1S/C30H27ClFN5O4S/c31-25-14-22(5-7-27(25)40-17-19-2-1-3-20(32)12-19)36-29-28-26(34-18-35-29)15-24(42-28)6-4-21-13-23(16-33-21)41-30(38)37-8-10-39-11-9-37/h1-3,5,7,12,14-15,18,21,23,33H,8-11,13,16-17H2,(H,34,35,36)/t21-,23+/m1/s1
n/an/a 79n/an/an/an/a7.523
GSK
Assay Description
Assays were performed in 96-well polystyrene round-bottomed plates in reaction buffer containing biotinylated substrate and purified kinase in the pr...
Bioorg Med Chem Lett 19: 21-6 (2009)
Article DOI: 10.1016/j.bmcl.2008.11.023
BindingDB Entry DOI: 10.7270/Q2NV9GKZ