null
SMILES: O=C(NC1CC1)c1nc2cccnn2c1-c1ccc2ccnn2c1
InChI Key: InChIKey=XWBNVRGWNULCLK-UHFFFAOYSA-N
Activity Spreadsheet -- Enzyme Inhibition Constant Data from BindingDB
Found 12 hits for monomerid = 285549
Trg + Lig
Ki
nM
ΔG°
kcal/mole
IC50
nM
Kd
nM
EC50/IC50
nM
koff
s-1
kon
M-1s-1
pHTemp
°C
Isoform 4 of cAMP-specific 3',5'-cyclic phosphodiesterase 4A (RD1)
(Homo sapiens (Human))
BDBM285549
(N-cyclopropyl-3-(pyrazolo[1,5-a]pyridin-6-yl)imida...)
Show SMILES O=C(NC1CC1)c1nc2cccnn2c1-c1ccc2ccnn2c1
Show InChI InChI=1S/C17H14N6O/c24-17(20-12-4-5-12)15-16(23-14(21-15)2-1-8-19-23)11-3-6-13-7-9-18-22(13)10-11/h1-3,6-10,12H,4-5H2,(H,20,24)
US Patent
n/an/a 27.6n/an/an/an/an/an/a
Pfizer Inc.
US Patent
Assay Description
The PDE4A3, PDE4B1, PDE4C1 and PDE4D3 assays use the Scintillation Proximity Assay (SPA) technology to measure the inhibition of human recombinant PD...
US Patent US10077269 (2018)
BindingDB Entry DOI: 10.7270/Q2P84DX5
cAMP-specific 3',5'-cyclic phosphodiesterase 4B [122-736,S654A]
(Homo sapiens (Human))
BDBM285549
(N-cyclopropyl-3-(pyrazolo[1,5-a]pyridin-6-yl)imida...)
Show SMILES O=C(NC1CC1)c1nc2cccnn2c1-c1ccc2ccnn2c1
Show InChI InChI=1S/C17H14N6O/c24-17(20-12-4-5-12)15-16(23-14(21-15)2-1-8-19-23)11-3-6-13-7-9-18-22(13)10-11/h1-3,6-10,12H,4-5H2,(H,20,24)
US Patent
n/an/a 58.9n/an/an/an/an/an/a
Pfizer Inc.
US Patent
Assay Description
The PDE4A3, PDE4B1, PDE4C1 and PDE4D3 assays use the Scintillation Proximity Assay (SPA) technology to measure the inhibition of human recombinant PD...
US Patent US10077269 (2018)
BindingDB Entry DOI: 10.7270/Q2P84DX5
Isoform 3 of cAMP-specific 3',5'-cyclic phosphodiesterase 4D (hPDE4D3)
(Homo sapiens (Human))
BDBM285549
(N-cyclopropyl-3-(pyrazolo[1,5-a]pyridin-6-yl)imida...)
Show SMILES O=C(NC1CC1)c1nc2cccnn2c1-c1ccc2ccnn2c1
Show InChI InChI=1S/C17H14N6O/c24-17(20-12-4-5-12)15-16(23-14(21-15)2-1-8-19-23)11-3-6-13-7-9-18-22(13)10-11/h1-3,6-10,12H,4-5H2,(H,20,24)
US Patent
n/an/a 71.2n/an/an/an/an/an/a
Pfizer Inc.
US Patent
Assay Description
The PDE4A3, PDE4B1, PDE4C1 and PDE4D3 assays use the Scintillation Proximity Assay (SPA) technology to measure the inhibition of human recombinant PD...
US Patent US10077269 (2018)
BindingDB Entry DOI: 10.7270/Q2P84DX5
Isoform 3 of cAMP-specific 3',5'-cyclic phosphodiesterase 4D (hPDE4D3)
(Homo sapiens (Human))
BDBM285549
(N-cyclopropyl-3-(pyrazolo[1,5-a]pyridin-6-yl)imida...)
Show SMILES O=C(NC1CC1)c1nc2cccnn2c1-c1ccc2ccnn2c1
Show InChI InChI=1S/C17H14N6O/c24-17(20-12-4-5-12)15-16(23-14(21-15)2-1-8-19-23)11-3-6-13-7-9-18-22(13)10-11/h1-3,6-10,12H,4-5H2,(H,20,24)
US Patent
n/an/a 1.89E+3n/an/an/an/an/an/a
Pfizer Inc.
US Patent
Assay Description
The PDE4A3, PDE4B1, PDE4C1 and PDE4D3 assays use the Scintillation Proximity Assay (SPA) technology to measure the inhibition of human recombinant PD...
US Patent US10077269 (2018)
BindingDB Entry DOI: 10.7270/Q2P84DX5
cAMP-specific 3',5'-cyclic phosphodiesterase 4A
(Homo sapiens (Human))
BDBM285549
(N-cyclopropyl-3-(pyrazolo[1,5-a]pyridin-6-yl)imida...)
Show SMILES O=C(NC1CC1)c1nc2cccnn2c1-c1ccc2ccnn2c1
Show InChI InChI=1S/C17H14N6O/c24-17(20-12-4-5-12)15-16(23-14(21-15)2-1-8-19-23)11-3-6-13-7-9-18-22(13)10-11/h1-3,6-10,12H,4-5H2,(H,20,24)
US Patent
n/an/a 27.6n/an/an/an/an/an/a
Pfizer Inc.
US Patent
Assay Description
The PDE4A3, PDE4B1, PDE4C1 and PDE4D3 assays use the Scintillation Proximity Assay (SPA) technology to measure the inhibition of human recombinant PD...
US Patent US9598421 (2017)
BindingDB Entry DOI: 10.7270/Q2K939KG
cAMP-specific 3',5'-cyclic phosphodiesterase 4D
(Homo sapiens (Human))
BDBM285549
(N-cyclopropyl-3-(pyrazolo[1,5-a]pyridin-6-yl)imida...)
Show SMILES O=C(NC1CC1)c1nc2cccnn2c1-c1ccc2ccnn2c1
Show InChI InChI=1S/C17H14N6O/c24-17(20-12-4-5-12)15-16(23-14(21-15)2-1-8-19-23)11-3-6-13-7-9-18-22(13)10-11/h1-3,6-10,12H,4-5H2,(H,20,24)
US Patent
n/an/a 1.89E+3n/an/an/an/an/an/a
Pfizer Inc.
US Patent
Assay Description
Human PDE4A3 coding sequence (amino acids 2 to 825 from the sequence with accession number NP_001104779) was cloned into the baculovirus expression v...
US Patent US10669279 (2020)
BindingDB Entry DOI: 10.7270/Q2765JC9
cAMP-specific 3',5'-cyclic phosphodiesterase 4C
(Homo sapiens (Human))
BDBM285549
(N-cyclopropyl-3-(pyrazolo[1,5-a]pyridin-6-yl)imida...)
Show SMILES O=C(NC1CC1)c1nc2cccnn2c1-c1ccc2ccnn2c1
Show InChI InChI=1S/C17H14N6O/c24-17(20-12-4-5-12)15-16(23-14(21-15)2-1-8-19-23)11-3-6-13-7-9-18-22(13)10-11/h1-3,6-10,12H,4-5H2,(H,20,24)
US Patent
n/an/a 71.2n/an/an/an/an/an/a
Pfizer Inc.
US Patent
US Patent US9598421 (2017)
BindingDB Entry DOI: 10.7270/Q2K939KG
cAMP-specific 3',5'-cyclic phosphodiesterase 4D
(Homo sapiens (Human))
BDBM285549
(N-cyclopropyl-3-(pyrazolo[1,5-a]pyridin-6-yl)imida...)
Show SMILES O=C(NC1CC1)c1nc2cccnn2c1-c1ccc2ccnn2c1
Show InChI InChI=1S/C17H14N6O/c24-17(20-12-4-5-12)15-16(23-14(21-15)2-1-8-19-23)11-3-6-13-7-9-18-22(13)10-11/h1-3,6-10,12H,4-5H2,(H,20,24)
US Patent
n/an/a 1.89E+3n/an/an/an/an/an/a
Pfizer Inc.
US Patent
US Patent US9598421 (2017)
BindingDB Entry DOI: 10.7270/Q2K939KG
cAMP-specific 3',5'-cyclic phosphodiesterase 4A
(Homo sapiens (Human))
BDBM285549
(N-cyclopropyl-3-(pyrazolo[1,5-a]pyridin-6-yl)imida...)
Show SMILES O=C(NC1CC1)c1nc2cccnn2c1-c1ccc2ccnn2c1
Show InChI InChI=1S/C17H14N6O/c24-17(20-12-4-5-12)15-16(23-14(21-15)2-1-8-19-23)11-3-6-13-7-9-18-22(13)10-11/h1-3,6-10,12H,4-5H2,(H,20,24)
US Patent
n/an/a 27.6n/an/an/an/an/an/a
Pfizer Inc.
US Patent
Assay Description
Human PDE4A3 coding sequence (amino acids 2 to 825 from the sequence with accession number NP_001104779) was cloned into the baculovirus expression v...
US Patent US10669279 (2020)
BindingDB Entry DOI: 10.7270/Q2765JC9
cAMP-specific 3',5'-cyclic phosphodiesterase 4B
(Homo sapiens (Human))
BDBM285549
(N-cyclopropyl-3-(pyrazolo[1,5-a]pyridin-6-yl)imida...)
Show SMILES O=C(NC1CC1)c1nc2cccnn2c1-c1ccc2ccnn2c1
Show InChI InChI=1S/C17H14N6O/c24-17(20-12-4-5-12)15-16(23-14(21-15)2-1-8-19-23)11-3-6-13-7-9-18-22(13)10-11/h1-3,6-10,12H,4-5H2,(H,20,24)
US Patent
n/an/a 58.9n/an/an/an/an/an/a
Pfizer Inc.
US Patent
Assay Description
Human PDE4A3 coding sequence (amino acids 2 to 825 from the sequence with accession number NP_001104779) was cloned into the baculovirus expression v...
US Patent US10669279 (2020)
BindingDB Entry DOI: 10.7270/Q2765JC9
cAMP-specific 3',5'-cyclic phosphodiesterase 4C
(Homo sapiens (Human))
BDBM285549
(N-cyclopropyl-3-(pyrazolo[1,5-a]pyridin-6-yl)imida...)
Show SMILES O=C(NC1CC1)c1nc2cccnn2c1-c1ccc2ccnn2c1
Show InChI InChI=1S/C17H14N6O/c24-17(20-12-4-5-12)15-16(23-14(21-15)2-1-8-19-23)11-3-6-13-7-9-18-22(13)10-11/h1-3,6-10,12H,4-5H2,(H,20,24)
US Patent
n/an/a 71.2n/an/an/an/an/an/a
Pfizer Inc.
US Patent
Assay Description
Human PDE4A3 coding sequence (amino acids 2 to 825 from the sequence with accession number NP_001104779) was cloned into the baculovirus expression v...
US Patent US10669279 (2020)
BindingDB Entry DOI: 10.7270/Q2765JC9
cAMP-specific 3',5'-cyclic phosphodiesterase 4B
(Homo sapiens (Human))
BDBM285549
(N-cyclopropyl-3-(pyrazolo[1,5-a]pyridin-6-yl)imida...)
Show SMILES O=C(NC1CC1)c1nc2cccnn2c1-c1ccc2ccnn2c1
Show InChI InChI=1S/C17H14N6O/c24-17(20-12-4-5-12)15-16(23-14(21-15)2-1-8-19-23)11-3-6-13-7-9-18-22(13)10-11/h1-3,6-10,12H,4-5H2,(H,20,24)
US Patent
n/an/a 58.9n/an/an/an/an/an/a
Pfizer Inc.
US Patent
US Patent US9598421 (2017)
BindingDB Entry DOI: 10.7270/Q2K939KG