BDBM285702 US10077289, Compound 10::[(2S,3R,4R)-1-(1H-Benzimidazol-2-yl)-3-hydroxy-4-methyl-2-(methylamino) pentanoic acid]1 cyclosporin A
SMILES: CC[C@H]1NC(=O)[C@@H]([C@H](O)[C@H](C)Cc2nc3ccccc3[nH]2)N(C)C(=O)[C@@H](C(C)C)N(C)C(=O)[C@@H](CC(C)C)N(C)C(=O)[C@@H](CC(C)C)N(C)C(=O)[C@H](C)NC(=O)[C@@H](C)NC(=O)[C@@H](CC(C)C)N(C)C(=O)[C@H](NC(=O)[C@H](CC(C)C)N(C)C(=O)CN(C)C1=O)C(C)C
InChI Key:
Data: 1 KI  1 IC50
Activity Spreadsheet -- Enzyme Inhibition Constant Data from BindingDB
Found 2 hits for monomerid = 285702
Trg + Lig
Ki
nM
ΔG°
kcal/mole
IC50
nM
Kd
nM
EC50/IC50
nM
koff
s-1
kon
M-1s-1
pHTemp
°C
Peptidyl-prolyl cis-trans isomerase A
(Homo sapiens (Human))
BDBM285702
(US10077289, Compound 10 | [(2S,3R,4R)-1-(1H-Benzim...)
Show SMILES CC[C@H]1NC(=O)[C@@H]([C@H](O)[C@H](C)Cc2nc3ccccc3[nH]2)N(C)C(=O)[C@@H](C(C)C)N(C)C(=O)[C@@H](CC(C)C)N(C)C(=O)[C@@H](CC(C)C)N(C)C(=O)[C@H](C)NC(=O)[C@@H](C)NC(=O)[C@@H](CC(C)C)N(C)C(=O)[C@H](NC(=O)[C@H](CC(C)C)N(C)C(=O)CN(C)C1=O)C(C)C |r|
Reactome pathway
US Patent
7.10n/an/an/an/an/an/a7.8n/a
Allergan, Inc.
US Patent
Assay Description
The protease-free PPIase assay measures the rate of cis to trans conversion of a peptide substrate catalyzed by the enzyme cyclophilin A. Addition of...
US Patent US10077289 (2018)
BindingDB Entry DOI: 10.7270/Q25B04JF
Serine/threonine-protein phosphatase 2B catalytic subunit gamma isoform
(Homo sapiens (Human))
BDBM285702
(US10077289, Compound 10 | [(2S,3R,4R)-1-(1H-Benzim...)
Show SMILES CC[C@H]1NC(=O)[C@@H]([C@H](O)[C@H](C)Cc2nc3ccccc3[nH]2)N(C)C(=O)[C@@H](C(C)C)N(C)C(=O)[C@@H](CC(C)C)N(C)C(=O)[C@@H](CC(C)C)N(C)C(=O)[C@H](C)NC(=O)[C@@H](C)NC(=O)[C@@H](CC(C)C)N(C)C(=O)[C@H](NC(=O)[C@H](CC(C)C)N(C)C(=O)CN(C)C1=O)C(C)C |r|
US Patent
n/an/a 4.00E+3n/an/an/an/an/an/a
Allergan, Inc.
US Patent
Assay Description
Enzo Life Sciences CaN Assay Kit: BML-AK8042x assay buffer: 100 mM Tris, pH7.5, 200 mM NaCl, 12 mM MgCl2, 1 mM DTT, 0.05% NP-40, 1 mM CaCl2
US Patent US10077289 (2018)
BindingDB Entry DOI: 10.7270/Q25B04JF