null
SMILES: C[C@H](NS(=O)(=O)c1ccc(-c2sc(nc2CC2CCC2)-c2noc(CC(C)(C)C(O)=O)n2)c(C(F)F)c1Cl)C(F)(F)F
InChI Key: InChIKey=BAXWSFPUQZKHFH-NSHDSACASA-N
Activity Spreadsheet -- Enzyme Inhibition Constant Data from BindingDB
Found 2 hits for monomerid = 285800
Trg + Lig
Ki
nM
ΔG°
kcal/mole
IC50
nM
Kd
nM
EC50/IC50
nM
koff
s-1
kon
M-1s-1
pHTemp
°C
Nuclear receptor ROR-gamma
(Homo sapiens (Human))
BDBM285800
(US10080744, Example 11/11)
Show SMILES C[C@H](NS(=O)(=O)c1ccc(-c2sc(nc2CC2CCC2)-c2noc(CC(C)(C)C(O)=O)n2)c(C(F)F)c1Cl)C(F)(F)F |r|
Show InChI InChI=1S/C25H26ClF5N4O5S2/c1-11(25(29,30)31)35-42(38,39)15-8-7-13(17(18(15)26)20(27)28)19-14(9-12-5-4-6-12)32-22(41-19)21-33-16(40-34-21)10-24(2,3)23(36)37/h7-8,11-12,20,35H,4-6,9-10H2,1-3H3,(H,36,37)/t11-/m0/s1
US Patent
n/an/a 4.30n/an/an/an/an/an/a
Janssen Pharmaceutica NV
US Patent
Assay Description
Cells used in this assay were transiently co-transfected with three different plasmids, one expressing the GAL4-DNA binding domain (DBD)-RORγt f...
US Patent US10080744 (2018)
BindingDB Entry DOI: 10.7270/Q21J9CVM
Nuclear receptor ROR-gamma
(Homo sapiens (Human))
BDBM285800
(US10080744, Example 11/11)
Show SMILES C[C@H](NS(=O)(=O)c1ccc(-c2sc(nc2CC2CCC2)-c2noc(CC(C)(C)C(O)=O)n2)c(C(F)F)c1Cl)C(F)(F)F |r|
Show InChI InChI=1S/C25H26ClF5N4O5S2/c1-11(25(29,30)31)35-42(38,39)15-8-7-13(17(18(15)26)20(27)28)19-14(9-12-5-4-6-12)32-22(41-19)21-33-16(40-34-21)10-24(2,3)23(36)37/h7-8,11-12,20,35H,4-6,9-10H2,1-3H3,(H,36,37)/t11-/m0/s1
US Patent
n/an/an/a 0.0240n/an/an/an/an/a
Janssen Pharmaceutica NV
US Patent
Assay Description
For the RORγt construct used in the ThermoFluor assay, numbering for the nucleotide sequences was based on the reference sequence for human ROR&...
US Patent US10080744 (2018)
BindingDB Entry DOI: 10.7270/Q21J9CVM