null
SMILES: CC[C@H](NS(=O)(=O)c1ccc(-c2sc(nc2CN2CC(F)(F)C[C@@H]2C)-c2noc(CC(C)(C)OC=O)n2)c(Cl)c1Cl)C(F)(F)F
InChI Key: InChIKey=ZIAVECXVGHTYGN-GUYCJALGSA-N
Activity Spreadsheet -- Enzyme Inhibition Constant Data from BindingDB
Found 2 hits for monomerid = 285803
Trg + Lig
Ki
nM
ΔG°
kcal/mole
IC50
nM
Kd
nM
EC50/IC50
nM
koff
s-1
kon
M-1s-1
pHTemp
°C
Nuclear receptor ROR-gamma
(Homo sapiens (Human))
BDBM285803
(US10080744, Example 12/2)
Show SMILES CC[C@H](NS(=O)(=O)c1ccc(-c2sc(nc2CN2CC(F)(F)C[C@@H]2C)-c2noc(CC(C)(C)OC=O)n2)c(Cl)c1Cl)C(F)(F)F |r|
Show InChI InChI=1S/C26H28Cl2F5N5O5S2/c1-5-17(26(31,32)33)37-45(40,41)16-7-6-14(19(27)20(16)28)21-15(10-38-11-25(29,30)8-13(38)2)34-23(44-21)22-35-18(43-36-22)9-24(3,4)42-12-39/h6-7,12-13,17,37H,5,8-11H2,1-4H3/t13-,17-/m0/s1
US Patent
n/an/a 4.80n/an/an/an/an/an/a
Janssen Pharmaceutica NV
US Patent
Assay Description
Cells used in this assay were transiently co-transfected with three different plasmids, one expressing the GAL4-DNA binding domain (DBD)-RORγt f...
US Patent US10080744 (2018)
BindingDB Entry DOI: 10.7270/Q21J9CVM
Nuclear receptor ROR-gamma
(Homo sapiens (Human))
BDBM285803
(US10080744, Example 12/2)
Show SMILES CC[C@H](NS(=O)(=O)c1ccc(-c2sc(nc2CN2CC(F)(F)C[C@@H]2C)-c2noc(CC(C)(C)OC=O)n2)c(Cl)c1Cl)C(F)(F)F |r|
Show InChI InChI=1S/C26H28Cl2F5N5O5S2/c1-5-17(26(31,32)33)37-45(40,41)16-7-6-14(19(27)20(16)28)21-15(10-38-11-25(29,30)8-13(38)2)34-23(44-21)22-35-18(43-36-22)9-24(3,4)42-12-39/h6-7,12-13,17,37H,5,8-11H2,1-4H3/t13-,17-/m0/s1
US Patent
n/an/an/a 0.0190n/an/an/an/an/a
Janssen Pharmaceutica NV
US Patent
Assay Description
For the RORγt construct used in the ThermoFluor assay, numbering for the nucleotide sequences was based on the reference sequence for human ROR&...
US Patent US10080744 (2018)
BindingDB Entry DOI: 10.7270/Q21J9CVM